program: Orca
programVersion: 5.0.2
elementType: O O O C C C C C C C C C C C C C C C C C C C C C C H H H H H H H H H H H H H H H H H H H H H H H H H H
charge: 0
multiplicity: 1
keywords: wb97x-d3
keywords: def2-TZVPP
keywords: def2/J RIJCOSX
keywords: DEFGRID2
keywords: scfconv7
keywords: smallprint printgap noloewdin
keywords: NOSOSCF
formula: C22H26O3
InChI: InChI=1/C22H26O3/c1-15(2)10-19-20(22(19,3)4)21(23)25-14-17-12-18(24-13-17)11-16-8-6-5-7-9-16/h5-10,12-13,19-20H,11,14H2,1-4H3
51 atoms
O  -1.744318 2.057481 0.004758
O  -1.212643 1.291598 2.040614
O  2.574184 2.346862 0.396933
C  -1.07333 -1.343105 0.282761
C  -2.177723 -1.412918 1.287366
C  -2.081289 -0.205378 0.391487
C  0.347017 -1.156739 0.76049
C  -1.166722 -2.175858 -0.972914
C  -3.307526 -2.367779 1.144588
C  -1.642814 1.096215 0.93397
C  -4.576465 -2.119115 1.471107
C  -5.642902 -3.159637 1.307103
C  -5.043896 -0.808537 2.026357
C  -0.970204 3.238619 0.231044
C  0.467331 2.923012 0.017287
C  1.077107 2.535557 -1.217942
C  1.429627 2.778585 0.956678
C  2.351514 2.189765 -0.925738
C  3.441576 1.58453 -1.73681
C  3.449243 0.080219 -1.59256
C  2.73415 -0.715707 -2.480647
C  4.116294 -0.53019 -0.536341
C  2.688317 -2.092337 -2.321629
C  4.071415 -1.906639 -0.373126
C  3.356311 -2.69231 -1.264506
H  -1.862052 -1.220624 2.310329
H  -2.785683 -0.142176 -0.430727
H  0.805938 -2.131616 0.935256
H  0.952281 -0.646473 0.008296
H  0.410856 -0.59095 1.686868
H  -2.189964 -2.27588 -1.335485
H  -0.569491 -1.727184 -1.768485
H  -0.774971 -3.180301 -0.797702
H  -3.060522 -3.356893 0.768507
H  -5.250778 -4.086003 0.88893
H  -6.439912 -2.803855 0.649118
H  -6.113513 -3.39574 2.264762
H  -4.237461 -0.091685 2.16304
H  -5.527163 -0.954434 2.995605
H  -5.793909 -0.354727 1.373257
H  -1.14752 3.646619 1.227325
H  -1.335353 3.957772 -0.501614
H  0.610812 2.497846 -2.189534
H  1.430747 2.92357 2.024332
H  4.408518 2.000105 -1.442572
H  3.28845 1.859397 -2.781631
H  2.205596 -0.254141 -3.306756
H  4.672249 0.076089 0.168361
H  2.129808 -2.696957 -3.024404
H  4.595933 -2.366567 0.454147
H  3.322008 -3.766301 -1.137781
totalener: -1079.72936916 hartree
nucrepener: 2209.25467137 hartree
electener: -3288.98404053 hartree
oneelecener: -5857.05053385 hartree
twoeener: 2568.06649332 hartree
kineticenergy: 1074.91685090 hartree
xcener: -106.468213871458 hartree
chargesum: 0.0000000
charge: -0.265808 -0.380073 -0.250635 0.188224 -0.015164 -0.120334 -0.244061 -0.292680 -0.247407 0.322068 -0.006237 -0.212384 -0.223417 0.067103 -0.062136 -0.279720 0.002105 0.215608 -0.138226 0.074258 -0.150135 -0.140890 -0.145615 -0.123630 -0.129845 0.106179 0.083801 0.087320 0.052115 0.100415 0.090298 0.084933 0.088892 0.091577 0.077436 0.083262 0.086735 0.083427 0.088942 0.084732 0.105564 0.103181 0.121371 0.142569 0.107959 0.100017 0.102797 0.110562 0.126316 0.123887 0.124746
qa: -0.2658 -0.3801 -0.2506 0.1882 -0.0152 -0.1203 -0.2441 -0.2927 -0.2474 0.3221 -0.0062 -0.2124 -0.2234 0.0671 -0.0621 -0.2797 0.0021 0.2156 -0.1382 0.0743 -0.1501 -0.1409 -0.1456 -0.1236 -0.1298 0.1062 0.0838 0.0873 0.0521 0.1004 0.0903 0.0849 0.0889 0.0916 0.0774 0.0833 0.0867 0.0834 0.0889 0.0847 0.1056 0.1032 0.1214 0.1426 0.1080 0.1000 0.1028 0.1106 0.1263 0.1239 0.1247
va: 2.1083 2.1197 2.3002 3.6793 3.8283 3.8309 3.9036 3.9092 3.9031 4.2506 3.7324 3.9417 3.9383 3.8978 3.7081 4.0245 3.9676 3.6089 3.8744 3.6135 3.9369 3.9846 3.9350 3.9510 3.9240 1.0252 1.0317 1.0057 1.0031 1.0258 1.0076 1.0099 1.0013 1.0096 1.0099 0.9992 0.9985 1.0192 1.0018 1.0009 1.0108 0.9914 1.0206 1.0114 1.0131 1.0123 1.0127 1.0166 0.9997 1.0005 1.0002
dispcorr: -0.028172477 hartree
energy: -1079.757541637568
dipole: -16.96317 16.95886 -0.00431 -17.57965 17.41645 -0.16320 0.51973 -1.26939 -0.74965
magnitude: 0.76722 au
magnitude: 1.95012 debye
