program: Orca
programVersion: 5.0.2
elementType: O O O C C C C C C C C C C C C C C C C C C C C C C H H H H H H H H H H H H H H H H H H H H H H H H H H
charge: 0
multiplicity: 1
keywords: wb97x-d3
keywords: def2-TZVPP
keywords: def2/J RIJCOSX
keywords: DEFGRID2
keywords: scfconv7
keywords: smallprint printgap noloewdin
keywords: NOSOSCF
formula: C22H26O3
InChI: InChI=1/C22H26O3/c1-15(2)10-19-20(22(19,3)4)21(23)25-14-17-12-18(24-13-17)11-16-8-6-5-7-9-16/h5-10,12-13,19-20H,11,14H2,1-4H3
51 atoms
O  -1.327459 1.98385 1.132607
O  -0.294437 0.033658 1.512266
O  1.783252 3.584451 -1.543398
C  -2.60085 -0.985258 -0.370012
C  -2.865459 -1.379712 1.053513
C  -2.552489 0.062812 0.726778
C  -1.329264 -1.467678 -1.025612
C  -3.754927 -0.879813 -1.338072
C  -4.210624 -1.736385 1.543796
C  -1.269532 0.651469 1.169391
C  -4.54388 -2.81268 2.259619
C  -5.960355 -3.029491 2.702433
C  -3.586917 -3.883177 2.688303
C  -0.134799 2.712096 1.444894
C  0.778833 2.803863 0.275067
C  1.69992 1.819089 -0.207115
C  0.881129 3.846816 -0.581417
C  2.276259 2.34614 -1.311673
C  3.289995 1.824627 -2.27035
C  3.742723 0.444882 -1.878162
C  2.97963 -0.6697 -2.211011
C  4.903732 0.261816 -1.137376
C  3.368445 -1.938803 -1.812393
C  5.298459 -1.006803 -0.738427
C  4.530507 -2.111059 -1.074346
H  -2.038314 -1.900493 1.523122
H  -3.387094 0.755711 0.731425
H  -1.513507 -2.425704 -1.515237
H  -0.995696 -0.763867 -1.791065
H  -0.512252 -1.604541 -0.321862
H  -4.654982 -0.465667 -0.885879
H  -3.487761 -0.239398 -2.180272
H  -4.011278 -1.863712 -1.734914
H  -5.006048 -1.038534 1.298419
H  -6.351051 -3.978242 2.326178
H  -6.624087 -2.235985 2.361365
H  -6.028165 -3.075998 3.792344
H  -3.905594 -4.855581 2.304828
H  -3.567872 -3.971004 3.77739
H  -2.566172 -3.718233 2.351713
H  0.369839 2.265834 2.303101
H  -0.48304 3.703201 1.734422
H  1.894331 0.849542 0.218854
H  0.390206 4.806175 -0.623493
H  4.147562 2.503063 -2.312567
H  2.868568 1.808899 -3.280855
H  2.066783 -0.541273 -2.780688
H  5.504533 1.121545 -0.865875
H  2.762072 -2.795043 -2.077127
H  6.206182 -1.131342 -0.162701
H  4.835599 -3.101335 -0.762996
totalener: -1079.73349082 hartree
nucrepener: 2111.04314296 hartree
electener: -3190.77663377 hartree
oneelecener: -5660.52732198 hartree
twoeener: 2469.75068821 hartree
kineticenergy: 1074.91052917 hartree
xcener: -106.467899940318 hartree
chargesum: 0.0000000
charge: -0.259059 -0.401098 -0.255831 0.096660 0.043685 -0.097196 -0.268412 -0.244236 -0.187838 0.363985 -0.051786 -0.203370 -0.235920 0.050835 -0.081642 -0.230432 -0.035745 0.174914 -0.054356 0.029134 -0.168787 -0.149116 -0.115934 -0.121754 -0.124552 0.089496 0.070095 0.086382 0.083087 0.099924 0.070284 0.090869 0.091318 0.070863 0.082303 0.075736 0.084844 0.083649 0.086717 0.083393 0.113652 0.095546 0.162524 0.134734 0.089504 0.095460 0.109644 0.107343 0.122978 0.123587 0.123918
qa: -0.2591 -0.4011 -0.2558 0.0967 0.0437 -0.0972 -0.2684 -0.2442 -0.1878 0.3640 -0.0518 -0.2034 -0.2359 0.0508 -0.0816 -0.2304 -0.0357 0.1749 -0.0544 0.0291 -0.1688 -0.1491 -0.1159 -0.1218 -0.1246 0.0895 0.0701 0.0864 0.0831 0.0999 0.0703 0.0909 0.0913 0.0709 0.0823 0.0757 0.0848 0.0836 0.0867 0.0834 0.1137 0.0955 0.1625 0.1347 0.0895 0.0955 0.1096 0.1073 0.1230 0.1236 0.1239
va: 2.1346 2.1008 2.3016 3.7446 3.7787 3.8900 3.9175 3.9105 3.8976 4.2154 3.8230 3.9353 3.9457 3.9100 3.7334 3.9525 3.9962 3.6782 3.8625 3.6650 3.9821 3.9906 3.9531 3.9660 3.9590 1.0356 1.0386 1.0015 1.0032 1.0214 1.0113 1.0043 1.0043 1.0213 0.9985 1.0123 0.9979 0.9994 0.9988 1.0155 1.0054 0.9968 1.0110 1.0079 1.0103 1.0057 1.0107 1.0117 1.0008 1.0007 0.9999
dispcorr: -0.023292834 hartree
energy: -1079.756783649085
dipole: -21.84466 21.47999 -0.36467 -20.88739 20.88426 -0.00312 3.52455 -3.70388 -0.17933
magnitude: 0.40639 au
magnitude: 1.03296 debye
