program: Orca
programVersion: 5.0.2
elementType: O O O C C C C C C C C C C C C C C C C C C C C C C H H H H H H H H H H H H H H H H H H H H H H H H H H
charge: 0
multiplicity: 1
keywords: wb97x-d3
keywords: def2-TZVPP
keywords: def2/J RIJCOSX
keywords: DEFGRID2
keywords: scfconv7
keywords: smallprint printgap noloewdin
keywords: NOSOSCF
formula: C22H26O3
InChI: InChI=1/C22H26O3/c1-15(2)10-19-20(22(19,3)4)21(23)25-14-17-12-18(24-13-17)11-16-8-6-5-7-9-16/h5-10,12-13,19-20H,11,14H2,1-4H3
51 atoms
O  -1.712046 1.955831 0.081227
O  -1.959095 0.173548 -1.251663
O  2.739043 1.83558 0.431885
C  -4.679725 -0.084649 0.293893
C  -3.67958 -1.071976 0.814475
C  -3.302707 0.394078 0.7132
C  -5.05749 -0.154182 -1.16621
C  -5.828185 0.353375 1.172573
C  -3.78256 -1.711431 2.138009
C  -2.269386 0.794589 -0.266623
C  -3.488347 -2.978468 2.440782
C  -3.631607 -3.484161 3.845793
C  -3.000394 -4.004688 1.463261
C  -0.663692 2.469252 -0.747633
C  0.668907 1.931283 -0.364859
C  1.181662 0.606689 -0.549837
C  1.665173 2.620343 0.239104
C  2.436762 0.608581 -0.044968
C  3.490059 -0.436996 0.041123
C  4.643159 -0.180467 -0.899298
C  5.778682 0.494546 -0.468449
C  4.572798 -0.593586 -2.225339
C  6.825371 0.749286 -1.34272
C  5.617355 -0.343964 -3.1011
C  6.748383 0.329196 -2.661645
H  -3.226632 -1.675997 0.036611
H  -3.275865 0.951965 1.642653
H  -4.256772 -0.53697 -1.79383
H  -5.921339 -0.810331 -1.288278
H  -5.338052 0.831566 -1.543448
H  -6.233675 1.303461 0.820696
H  -6.633098 -0.383145 1.143924
H  -5.543509 0.488629 2.215051
H  -4.121663 -1.074595 2.949861
H  -4.338057 -4.316939 3.894037
H  -3.979935 -2.71056 4.529279
H  -2.679236 -3.862706 4.226035
H  -2.895036 -3.630906 0.447677
H  -3.682891 -4.857618 1.43054
H  -2.028895 -4.397996 1.772626
H  -0.689769 3.548677 -0.598845
H  -0.880065 2.266984 -1.79768
H  0.671961 -0.227583 -1.002059
H  1.744416 3.642878 0.572348
H  3.025369 -1.397014 -0.190105
H  3.857821 -0.511955 1.068492
H  5.846322 0.82424 0.56125
H  3.690105 -1.115318 -2.576376
H  7.703339 1.275657 -0.991619
H  5.549165 -0.676944 -4.128564
H  7.565528 0.522982 -3.343892
totalener: -1079.73345807 hartree
nucrepener: 2043.19232731 hartree
electener: -3122.92578538 hartree
oneelecener: -5524.73904173 hartree
twoeener: 2401.81325635 hartree
kineticenergy: 1074.90118702 hartree
xcener: -106.465103832656 hartree
chargesum: -0.0000000
charge: -0.259817 -0.413653 -0.254472 0.079670 0.041437 -0.079571 -0.257005 -0.252270 -0.182705 0.365350 -0.053396 -0.202168 -0.238073 0.061064 -0.077466 -0.251302 -0.034693 0.222462 -0.139856 0.095184 -0.156817 -0.169019 -0.122988 -0.121560 -0.135605 0.086879 0.072006 0.100021 0.084830 0.083981 0.089919 0.093342 0.071861 0.070358 0.083524 0.075869 0.083525 0.083832 0.085425 0.085222 0.094367 0.112908 0.150496 0.133712 0.104809 0.103475 0.107053 0.108828 0.123064 0.123653 0.124310
qa: -0.2598 -0.4137 -0.2545 0.0797 0.0414 -0.0796 -0.2570 -0.2523 -0.1827 0.3653 -0.0534 -0.2022 -0.2381 0.0611 -0.0775 -0.2513 -0.0347 0.2225 -0.1399 0.0952 -0.1568 -0.1690 -0.1230 -0.1216 -0.1356 0.0869 0.0720 0.1000 0.0848 0.0840 0.0899 0.0933 0.0719 0.0704 0.0835 0.0759 0.0835 0.0838 0.0854 0.0852 0.0944 0.1129 0.1505 0.1337 0.1048 0.1035 0.1071 0.1088 0.1231 0.1237 0.1243
va: 2.1364 2.0804 2.3133 3.7344 3.7877 3.8603 3.9118 3.9198 3.9111 4.2062 3.8320 3.9338 3.9444 3.8908 3.7616 4.0383 3.9973 3.6285 3.8851 3.6063 4.0143 4.0069 3.9564 3.9625 3.9623 1.0356 1.0366 1.0220 1.0010 1.0024 1.0041 1.0031 1.0107 1.0221 0.9980 1.0124 0.9982 1.0161 0.9989 0.9990 0.9984 1.0084 1.0214 1.0070 1.0100 1.0082 1.0142 1.0115 1.0004 1.0004 0.9999
dispcorr: -0.021493514 hartree
energy: -1079.754951586704
dipole: -25.17940 24.94377 -0.23563 -15.62319 15.66210 0.03891 8.40085 -7.98064 0.42020
magnitude: 0.48333 au
magnitude: 1.22852 debye
