program: Orca
programVersion: 5.0.2
elementType: O O O C C C C C C C C C C C C C C C C C C C C C C H H H H H H H H H H H H H H H H H H H H H H H H H H
charge: 0
multiplicity: 1
keywords: wb97x-d3
keywords: def2-TZVPP
keywords: def2/J RIJCOSX
keywords: DEFGRID2
keywords: scfconv7
keywords: smallprint printgap noloewdin
keywords: NOSOSCF
formula: C22H26O3
InChI: InChI=1/C22H26O3/c1-15(2)10-19-20(22(19,3)4)21(23)25-14-17-12-18(24-13-17)11-16-8-6-5-7-9-16/h5-10,12-13,19-20H,11,14H2,1-4H3
51 atoms
O  -1.754729 1.967569 0.077854
O  -2.029664 0.213353 -1.285788
O  2.681571 1.760076 0.397734
C  -4.724819 -0.065947 0.2994
C  -3.720418 -1.069418 0.778958
C  -3.338623 0.397165 0.705642
C  -5.129505 -0.099847 -1.154628
C  -5.855034 0.35853 1.208007
C  -3.805781 -1.742448 2.086659
C  -2.32141 0.815421 -0.283368
C  -3.49799 -3.014261 2.354086
C  -3.634696 -3.560628 3.744499
C  -3.005385 -4.009958 1.347549
C  -0.711968 2.488834 -0.753747
C  0.6175 1.921145 -0.404738
C  1.116964 0.602618 -0.656671
C  1.618752 2.566098 0.238941
C  2.368333 0.562905 -0.143295
C  3.395977 -0.507745 -0.084366
C  4.64527 -0.182523 -0.867671
C  4.586507 -0.033267 -2.250042
C  5.869037 -0.030456 -0.230427
C  5.728291 0.254628 -2.978857
C  7.015871 0.260041 -0.956918
C  6.948738 0.402201 -2.333218
H  -3.284046 -1.656019 -0.021324
H  -3.293242 0.933534 1.646912
H  -4.342102 -0.4704 -1.805842
H  -5.997649 -0.750341 -1.275923
H  -5.414073 0.895038 -1.503606
H  -6.665067 -0.372258 1.177055
H  -5.551258 0.468823 2.248019
H  -6.260411 1.318752 0.88477
H  -4.147328 -1.131109 2.916679
H  -4.335818 -4.398923 3.770182
H  -3.986836 -2.809275 4.450401
H  -2.679369 -3.943897 4.112087
H  -3.698125 -4.852369 1.270174
H  -2.044528 -4.427352 1.659439
H  -2.876021 -3.599659 0.34874
H  -0.720921 3.563777 -0.574383
H  -0.947679 2.318903 -1.805326
H  0.599363 -0.202504 -1.150932
H  1.708877 3.569368 0.624059
H  2.940414 -1.421889 -0.471838
H  3.659923 -0.715902 0.956639
H  3.634897 -0.138194 -2.758195
H  5.92859 -0.138997 0.845967
H  5.666666 0.364407 -4.053717
H  7.96192 0.376008 -0.444382
H  7.841457 0.626994 -2.901788
totalener: -1079.73379167 hartree
nucrepener: 2042.45862324 hartree
electener: -3122.19241491 hartree
oneelecener: -5523.25778535 hartree
twoeener: 2401.06537044 hartree
kineticenergy: 1074.90435482 hartree
xcener: -106.466101097971 hartree
chargesum: -0.0000000
charge: -0.259522 -0.414402 -0.249748 0.079012 0.039627 -0.078338 -0.256715 -0.253226 -0.181807 0.366436 -0.052991 -0.202262 -0.238658 0.059552 -0.071039 -0.258945 -0.037813 0.215666 -0.120903 0.056800 -0.155484 -0.141554 -0.129619 -0.125425 -0.129698 0.086995 0.072118 0.099981 0.085035 0.083881 0.093487 0.072039 0.090082 0.070670 0.083586 0.075704 0.083503 0.086364 0.084312 0.084420 0.094831 0.112569 0.153302 0.134121 0.111272 0.093125 0.115105 0.104278 0.123917 0.122455 0.123903
qa: -0.2595 -0.4144 -0.2497 0.0790 0.0396 -0.0783 -0.2567 -0.2532 -0.1818 0.3664 -0.0530 -0.2023 -0.2387 0.0596 -0.0710 -0.2589 -0.0378 0.2157 -0.1209 0.0568 -0.1555 -0.1416 -0.1296 -0.1254 -0.1297 0.0870 0.0721 0.1000 0.0850 0.0839 0.0935 0.0720 0.0901 0.0707 0.0836 0.0757 0.0835 0.0864 0.0843 0.0844 0.0948 0.1126 0.1533 0.1341 0.1113 0.0931 0.1151 0.1043 0.1239 0.1225 0.1239
va: 2.1361 2.0801 2.3145 3.7354 3.7909 3.8554 3.9112 3.9204 3.9118 4.2073 3.8320 3.9338 3.9439 3.8904 3.7458 4.0236 4.0016 3.6268 3.8769 3.6647 3.9902 3.9975 3.9673 3.9643 3.9588 1.0349 1.0364 1.0220 1.0010 1.0024 1.0031 1.0108 1.0041 1.0219 0.9978 1.0124 0.9985 0.9986 0.9993 1.0161 0.9984 1.0086 1.0205 1.0075 1.0045 1.0095 1.0117 1.0118 1.0009 1.0010 1.0000
dispcorr: -0.021490617 hartree
energy: -1079.755282282221
dipole: -25.11686 24.87461 -0.24225 -15.65679 15.67922 0.02243 8.26144 -7.83631 0.42514
magnitude: 0.48982 au
magnitude: 1.24503 debye
