program: Orca
programVersion: 5.0.2
elementType: O O O C C C C C C C C C C C C C C C C C C C C C C H H H H H H H H H H H H H H H H H H H H H H H H H H
charge: 0
multiplicity: 1
keywords: wb97x-d3
keywords: def2-TZVPP
keywords: def2/J RIJCOSX
keywords: DEFGRID2
keywords: scfconv7
keywords: smallprint printgap noloewdin
keywords: NOSOSCF
formula: C22H26O3
InChI: InChI=1/C22H26O3/c1-15(2)10-19-20(22(19,3)4)21(23)25-14-17-12-18(24-13-17)11-16-8-6-5-7-9-16/h5-10,12-13,19-20H,11,14H2,1-4H3
51 atoms
O  -0.99702 1.08659 1.544051
O  -2.239028 2.73489 0.681132
O  1.318428 2.448386 -1.878673
C  -3.086849 -0.593695 -0.086458
C  -3.141764 -0.821607 1.396783
C  -3.198958 0.584288 0.866713
C  -1.795215 -0.86124 -0.821355
C  -4.312593 -0.879466 -0.918675
C  -4.336235 -1.387058 2.07758
C  -2.11646 1.584067 1.012608
C  -4.69142 -2.672185 2.061134
C  -5.901087 -3.158009 2.800513
C  -3.923559 -3.72732 1.324824
C  0.150206 1.943025 1.553766
C  0.824887 1.962403 0.226774
C  1.90089 1.124208 -0.207734
C  0.519017 2.742632 -0.837594
C  2.16113 1.467165 -1.491205
C  3.147454 0.981978 -2.496048
C  4.212777 0.133334 -1.857611
C  5.255585 0.729512 -1.154683
C  4.164888 -1.25288 -1.93298
C  6.231124 -0.042549 -0.545313
C  5.13929 -2.030707 -1.322765
C  6.175683 -1.427156 -0.628269
H  -2.190243 -1.098728 1.842022
H  -4.174302 1.060213 0.864332
H  -1.681471 -0.186029 -1.671637
H  -0.914154 -0.751173 -0.193507
H  -1.796896 -1.881565 -1.211177
H  -5.237006 -0.653659 -0.389361
H  -4.296588 -0.289041 -1.83653
H  -4.348695 -1.933433 -1.202137
H  -4.946404 -0.691125 2.646591
H  -5.630632 -3.907537 3.548425
H  -6.60983 -3.638206 2.121043
H  -6.421318 -2.348344 3.310793
H  -3.547393 -4.48523 2.016834
H  -3.074093 -3.325912 0.775638
H  -4.567628 -4.25101 0.613994
H  0.808775 1.518894 2.310497
H  -0.130337 2.94717 1.872786
H  2.4181 0.375635 0.370793
H  -0.220917 3.51095 -0.988075
H  3.603818 1.839848 -2.999265
H  2.636144 0.412567 -3.278927
H  5.30056 1.809694 -1.081329
H  3.356774 -1.730126 -2.474341
H  7.0382 0.436448 -0.006508
H  5.088762 -3.109296 -1.393742
H  6.938633 -2.031094 -0.155065
totalener: -1079.72974545 hartree
nucrepener: 2093.87240984 hartree
electener: -3173.60215530 hartree
oneelecener: -5625.90074989 hartree
twoeener: 2452.29859460 hartree
kineticenergy: 1074.91165251 hartree
xcener: -106.467105557406 hartree
chargesum: 0.0000000
charge: -0.263340 -0.380524 -0.254282 0.076040 0.012109 -0.094698 -0.276618 -0.252111 -0.217729 0.340551 -0.016203 -0.210005 -0.247912 0.036008 -0.084679 -0.258140 0.003716 0.176830 -0.057869 0.014314 -0.162310 -0.143558 -0.117650 -0.125552 -0.129317 0.103196 0.083971 0.100882 0.088995 0.082783 0.083762 0.099663 0.081305 0.089860 0.085312 0.084213 0.079627 0.097995 0.082790 0.088329 0.098465 0.119139 0.137805 0.156962 0.101084 0.087267 0.113801 0.108722 0.125500 0.124984 0.126517
qa: -0.2633 -0.3805 -0.2543 0.0760 0.0121 -0.0947 -0.2766 -0.2521 -0.2177 0.3406 -0.0162 -0.2100 -0.2479 0.0360 -0.0847 -0.2581 0.0037 0.1768 -0.0579 0.0143 -0.1623 -0.1436 -0.1177 -0.1256 -0.1293 0.1032 0.0840 0.1009 0.0890 0.0828 0.0838 0.0997 0.0813 0.0899 0.0853 0.0842 0.0796 0.0980 0.0828 0.0883 0.0985 0.1191 0.1378 0.1570 0.1011 0.0873 0.1138 0.1087 0.1255 0.1250 0.1265
va: 2.1046 2.1174 2.3059 3.7338 3.7788 3.8438 3.9154 3.9048 3.8668 4.2807 3.7346 3.9386 3.9378 3.8722 3.6827 3.9785 3.9635 3.6786 3.8482 3.6790 3.9860 3.9709 3.9519 3.9632 3.9551 1.0226 1.0311 1.0015 1.0161 1.0048 1.0076 1.0053 1.0015 1.0142 0.9981 0.9989 1.0107 1.0036 1.0096 0.9988 0.9975 1.0089 1.0089 1.0141 1.0075 1.0067 1.0099 1.0115 1.0001 1.0006 0.9996
dispcorr: -0.024517432 hartree
energy: -1079.754262885396
dipole: -20.29970 20.69955 0.39986 -21.67743 20.57475 -1.10268 3.40758 -3.33660 0.07098
magnitude: 1.17509 au
magnitude: 2.98684 debye
