program: Orca
programVersion: 5.0.2
elementType: O O O C C C C C C C C C C C C C C C C C C C C C C H H H H H H H H H H H H H H H H H H H H H H H H H H
charge: 0
multiplicity: 1
keywords: wb97x-d3
keywords: def2-TZVPP
keywords: def2/J RIJCOSX
keywords: DEFGRID2
keywords: scfconv7
keywords: smallprint printgap noloewdin
keywords: NOSOSCF
formula: C22H26O3
InChI: InChI=1/C22H26O3/c1-15(2)10-19-20(22(19,3)4)21(23)25-14-17-12-18(24-13-17)11-16-8-6-5-7-9-16/h5-10,12-13,19-20H,11,14H2,1-4H3
51 atoms
O  -1.779459 2.395971 0.769429
O  -2.087898 1.586908 -1.292522
O  2.152422 2.253815 -1.18253
C  -3.959921 -0.484711 0.098561
C  -2.584483 -1.06749 -0.010588
C  -2.775725 0.308166 0.610062
C  -4.672189 -0.085625 -1.171698
C  -4.907016 -1.009709 1.152643
C  -2.103069 -2.18431 0.820757
C  -2.199779 1.470441 -0.100022
C  -1.358315 -3.216501 0.4156
C  -0.933712 -4.281364 1.383611
C  -0.880668 -3.428826 -0.989294
C  -0.993253 3.466435 0.236577
C  0.379498 2.990891 -0.074685
C  1.365578 2.546337 0.861745
C  0.92086 2.77877 -1.295821
C  2.416187 2.104008 0.132808
C  3.686759 1.433008 0.504817
C  3.684133 -0.037363 0.149929
C  4.650336 -0.571661 -0.691583
C  2.706725 -0.882319 0.667567
C  4.649091 -1.923839 -1.006556
C  2.705015 -2.232264 0.359627
C  3.677067 -2.758978 -0.480365
H  -2.173385 -1.019907 -1.012463
H  -2.687254 0.359302 1.689565
H  -3.991978 0.220163 -1.96155
H  -5.258218 -0.929989 -1.539313
H  -5.363341 0.739151 -0.98754
H  -5.381244 -1.931901 0.812663
H  -4.417825 -1.222948 2.102181
H  -5.69594 -0.281963 1.349506
H  -2.379997 -2.153073 1.870494
H  -1.287606 -4.085524 2.395169
H  0.155807 -4.368823 1.423116
H  -1.309235 -5.262016 1.080603
H  0.210932 -3.410903 -1.03464
H  -1.245788 -2.686319 -1.694014
H  -1.193315 -4.409817 -1.354975
H  -0.982385 4.218908 1.024772
H  -1.469774 3.902657 -0.642793
H  1.288552 2.545377 1.937424
H  0.544099 2.933651 -2.29344
H  3.827178 1.55517 1.581376
H  4.53642 1.927087 0.026014
H  5.412262 0.075223 -1.10992
H  1.930859 -0.479149 1.307638
H  5.408413 -2.322401 -1.666575
H  1.939082 -2.873712 0.776586
H  3.674876 -3.813484 -0.723284
totalener: -1079.73166932 hartree
nucrepener: 2169.52351656 hartree
electener: -3249.25518588 hartree
oneelecener: -5777.41406550 hartree
twoeener: 2528.15887961 hartree
kineticenergy: 1074.92219664 hartree
xcener: -106.469824335437 hartree
chargesum: -0.0000000
charge: -0.269898 -0.399907 -0.247201 0.093261 0.041444 -0.091538 -0.254386 -0.252525 -0.183201 0.361351 -0.082518 -0.196392 -0.210843 0.069004 -0.072882 -0.302401 0.014372 0.222266 -0.118330 0.076443 -0.159839 -0.180433 -0.097849 -0.116048 -0.159358 0.091987 0.068508 0.100990 0.082711 0.082479 0.093723 0.070833 0.090620 0.070392 0.078114 0.077808 0.088923 0.072442 0.084262 0.085494 0.104790 0.103730 0.128580 0.140795 0.106451 0.090666 0.105387 0.114441 0.122941 0.139422 0.120918
qa: -0.2699 -0.3999 -0.2472 0.0933 0.0414 -0.0915 -0.2544 -0.2525 -0.1832 0.3614 -0.0825 -0.1964 -0.2108 0.0690 -0.0729 -0.3024 0.0144 0.2223 -0.1183 0.0764 -0.1598 -0.1804 -0.0978 -0.1160 -0.1594 0.0920 0.0685 0.1010 0.0827 0.0825 0.0937 0.0708 0.0906 0.0704 0.0781 0.0778 0.0889 0.0724 0.0843 0.0855 0.1048 0.1037 0.1286 0.1408 0.1065 0.0907 0.1054 0.1144 0.1229 0.1394 0.1209
va: 2.1254 2.1004 2.3144 3.7270 3.7892 3.8808 3.9080 3.9189 3.8929 4.2012 3.8503 3.9282 3.9342 3.8904 3.6888 4.0267 3.9858 3.6155 3.8898 3.6674 4.0080 4.0323 3.9484 3.9211 3.9762 1.0345 1.0383 1.0243 1.0003 1.0032 1.0033 1.0102 1.0042 1.0221 1.0122 0.9966 0.9985 1.0088 1.0178 1.0003 0.9907 1.0117 1.0172 1.0123 1.0031 1.0141 1.0115 1.0164 1.0002 0.9852 1.0036
dispcorr: -0.024504001 hartree
energy: -1079.756173319294
dipole: -14.82372 14.89331 0.06959 -20.69320 20.47952 -0.21369 3.48511 -2.87679 0.60832
magnitude: 0.64850 au
magnitude: 1.64836 debye
