program: Orca
programVersion: 5.0.2
elementType: O O O C C C C C C C C C C C C C C C C C C C C C C H H H H H H H H H H H H H H H H H H H H H H H H H H
charge: 0
multiplicity: 1
keywords: wb97x-d3
keywords: def2-TZVPP
keywords: def2/J RIJCOSX
keywords: DEFGRID2
keywords: scfconv7
keywords: smallprint printgap noloewdin
keywords: NOSOSCF
formula: C22H26O3
InChI: InChI=1/C22H26O3/c1-15(2)10-19-20(22(19,3)4)21(23)25-14-17-12-18(24-13-17)11-16-8-6-5-7-9-16/h5-10,12-13,19-20H,11,14H2,1-4H3
51 atoms
O  -1.693075 2.099309 0.046633
O  -0.999287 0.997053 1.867829
O  2.349229 2.729299 -1.429253
C  -1.815387 -1.434753 0.038338
C  -2.79797 -1.260512 1.160448
C  -2.442783 -0.075587 0.291391
C  -0.366838 -1.683532 0.384969
C  -2.232279 -2.136189 -1.232661
C  -4.163786 -1.812525 1.113413
C  -1.638351 1.033497 0.847654
C  -4.828959 -2.403046 2.108983
C  -6.221283 -2.920916 1.898154
C  -4.292779 -2.612377 3.492891
C  -0.817744 3.194366 0.338487
C  0.570224 2.907966 -0.114531
C  1.602911 2.208637 0.58749
C  1.093531 3.195701 -1.330094
C  2.654493 2.126843 -0.2594
C  3.971835 1.446613 -0.162147
C  3.99749 0.168458 -0.968083
C  4.640621 0.10465 -2.196874
C  3.332393 -0.96072 -0.50025
C  4.623017 -1.064893 -2.944949
C  3.313545 -2.129978 -1.24253
C  3.959649 -2.185143 -2.470159
H  -2.335876 -1.225646 2.140516
H  -3.17834 0.230051 -0.444694
H  -0.078403 -1.245663 1.337472
H  -0.186625 -2.75891 0.443464
H  0.293297 -1.27863 -0.38499
H  -2.167177 -3.218965 -1.111358
H  -3.25041 -1.900749 -1.539561
H  -1.571328 -1.853005 -2.053421
H  -4.679015 -1.721256 0.16158
H  -6.927096 -2.443912 2.582942
H  -6.275814 -3.994787 2.0948
H  -6.57442 -2.749343 0.881933
H  -4.263296 -3.677354 3.736386
H  -4.946679 -2.143607 4.232118
H  -3.291778 -2.214707 3.640938
H  -0.845924 3.436216 1.401873
H  -1.236915 4.036135 -0.211574
H  1.548451 1.81067 1.586832
H  0.697039 3.710245 -2.190823
H  4.160475 1.229025 0.890797
H  4.772595 2.114583 -0.490133
H  5.157696 0.977605 -2.57667
H  2.816528 -0.920479 0.452263
H  5.12723 -1.098582 -3.901908
H  2.792507 -2.999167 -0.862235
H  3.945572 -3.097269 -3.052072
totalener: -1079.73246432 hartree
nucrepener: 2131.12246847 hartree
electener: -3210.85493280 hartree
oneelecener: -5700.60528545 hartree
twoeener: 2489.75035265 hartree
kineticenergy: 1074.91553295 hartree
xcener: -106.468355828412 hartree
chargesum: -0.0000000
charge: -0.258554 -0.401596 -0.249216 0.105746 0.041855 -0.080759 -0.291929 -0.254371 -0.186361 0.361771 -0.055065 -0.203344 -0.236624 0.045584 -0.055456 -0.286458 -0.031637 0.237358 -0.136035 0.100921 -0.150600 -0.203879 -0.121229 -0.125171 -0.132510 0.088624 0.069540 0.096539 0.087928 0.098099 0.091361 0.071665 0.094391 0.069438 0.084283 0.082772 0.076015 0.084782 0.085302 0.083445 0.113339 0.099136 0.143814 0.134611 0.110073 0.097710 0.105828 0.124333 0.122918 0.127351 0.124265
qa: -0.2586 -0.4016 -0.2492 0.1057 0.0419 -0.0808 -0.2919 -0.2544 -0.1864 0.3618 -0.0551 -0.2033 -0.2366 0.0456 -0.0555 -0.2865 -0.0316 0.2374 -0.1360 0.1009 -0.1506 -0.2039 -0.1212 -0.1252 -0.1325 0.0886 0.0695 0.0965 0.0879 0.0981 0.0914 0.0717 0.0944 0.0694 0.0843 0.0828 0.0760 0.0848 0.0853 0.0834 0.1133 0.0991 0.1438 0.1346 0.1101 0.0977 0.1058 0.1243 0.1229 0.1274 0.1243
va: 2.1326 2.1031 2.3122 3.7405 3.7947 3.8589 3.9226 3.9111 3.9079 4.2360 3.8311 3.9340 3.9446 3.9060 3.7006 4.0064 3.9987 3.5871 3.8840 3.5989 4.0118 3.9841 3.9572 3.9509 3.9672 1.0324 1.0373 1.0215 1.0017 0.9952 1.0035 1.0113 1.0039 1.0219 0.9983 0.9981 1.0123 0.9989 0.9992 1.0167 1.0055 0.9968 1.0243 1.0071 1.0075 1.0132 1.0124 1.0012 1.0004 0.9991 0.9997
dispcorr: -0.024256268 hartree
energy: -1079.756720590932
dipole: -19.20454 19.02335 -0.18119 -21.08758 20.93546 -0.15212 6.30614 -6.68375 -0.37761
magnitude: 0.44560 au
magnitude: 1.13263 debye
