program: Orca
programVersion: 5.0.2
elementType: O O O C C C C C C C C C C C C C C C C C C C C C C H H H H H H H H H H H H H H H H H H H H H H H H H H
charge: 0
multiplicity: 1
keywords: wb97x-d3
keywords: def2-TZVPP
keywords: def2/J RIJCOSX
keywords: DEFGRID2
keywords: scfconv7
keywords: smallprint printgap noloewdin
keywords: NOSOSCF
formula: C22H26O3
InChI: InChI=1/C22H26O3/c1-15(2)10-19-20(22(19,3)4)21(23)25-14-17-12-18(24-13-17)11-16-8-6-5-7-9-16/h5-10,12-13,19-20H,11,14H2,1-4H3
51 atoms
O  -1.012645 1.137908 0.131719
O  -3.116686 1.867289 -0.054891
O  3.116295 2.569293 0.068657
C  -3.720088 -0.667522 1.691699
C  -4.037871 -0.956928 0.255301
C  -2.68208 -0.389236 0.621149
C  -4.44973 0.465379 2.37256
C  -3.412563 -1.810295 2.630097
C  -4.13236 -2.326187 -0.284574
C  -2.336386 0.986104 0.198758
C  -5.107891 -2.817276 -1.052523
C  -5.06162 -4.235051 -1.540041
C  -6.312034 -2.044983 -1.500046
C  -0.522605 2.425488 -0.251666
C  0.953265 2.32553 -0.357699
C  1.708605 1.612773 -1.341516
C  1.87068 2.879575 0.467166
C  3.013241 1.795291 -1.031761
C  4.27356 1.282457 -1.627568
C  4.950745 0.254639 -0.75129
C  6.150465 0.535294 -0.111872
C  4.366322 -0.994017 -0.562207
C  6.761073 -0.413708 0.696921
C  4.973345 -1.944412 0.241426
C  6.174827 -1.656405 0.874686
H  -4.695229 -0.224622 -0.200146
H  -1.846994 -1.081126 0.603987
H  -4.726852 1.26395 1.689521
H  -5.363787 0.085136 2.832345
H  -3.839091 0.899493 3.16689
H  -2.855734 -1.44971 3.496567
H  -4.336072 -2.264989 2.992761
H  -2.819528 -2.597672 2.167032
H  -3.315211 -2.995152 -0.030361
H  -5.07453 -4.275995 -2.632263
H  -5.933841 -4.797899 -1.19772
H  -4.170082 -4.75891 -1.197113
H  -7.229089 -2.550435 -1.186295
H  -6.349004 -1.985219 -2.591156
H  -6.350465 -1.029499 -1.112276
H  -0.812151 3.175294 0.488975
H  -0.967005 2.724862 -1.203906
H  1.321708 1.037796 -2.16765
H  1.780655 3.501252 1.34346
H  4.960283 2.109586 -1.826879
H  4.030677 0.843619 -2.597614
H  6.613829 1.505552 -0.244802
H  3.422342 -1.220671 -1.044198
H  7.695815 -0.179043 1.189198
H  4.508178 -2.912285 0.375318
H  6.649783 -2.397816 1.503515
totalener: -1079.73306664 hartree
nucrepener: 2015.97521147 hartree
electener: -3095.70827811 hartree
oneelecener: -5470.08472198 hartree
twoeener: 2374.37644387 hartree
kineticenergy: 1074.91175957 hartree
xcener: -106.465296635750 hartree
chargesum: 0.0000000
charge: -0.251244 -0.392723 -0.249490 0.086535 0.045310 -0.086417 -0.260364 -0.242568 -0.185715 0.332162 -0.049648 -0.204414 -0.237974 0.053424 -0.028971 -0.266128 -0.026781 0.212492 -0.136399 0.068490 -0.146677 -0.155041 -0.122919 -0.127932 -0.132493 0.087967 0.071185 0.101477 0.084309 0.083808 0.091241 0.091431 0.070269 0.070694 0.084077 0.083879 0.076408 0.083975 0.087060 0.084237 0.091311 0.102313 0.129124 0.136253 0.095844 0.111092 0.105424 0.110177 0.123675 0.123609 0.124648
qa: -0.2512 -0.3927 -0.2495 0.0865 0.0453 -0.0864 -0.2604 -0.2426 -0.1857 0.3322 -0.0496 -0.2044 -0.2380 0.0534 -0.0290 -0.2661 -0.0268 0.2125 -0.1364 0.0685 -0.1467 -0.1550 -0.1229 -0.1279 -0.1325 0.0880 0.0712 0.1015 0.0843 0.0838 0.0912 0.0914 0.0703 0.0707 0.0841 0.0839 0.0764 0.0840 0.0871 0.0842 0.0913 0.1023 0.1291 0.1363 0.0958 0.1111 0.1054 0.1102 0.1237 0.1236 0.1246
va: 2.1301 2.1115 2.3129 3.7419 3.7671 3.8993 3.9122 3.9161 3.9047 4.2254 3.8201 3.9349 3.9462 3.8769 3.7374 4.0298 3.9813 3.6324 3.8868 3.6407 4.0040 3.9957 3.9605 3.9730 3.9609 1.0368 1.0369 1.0226 1.0011 1.0026 1.0043 1.0041 1.0110 1.0215 0.9981 0.9984 1.0122 0.9995 0.9988 1.0152 1.0039 0.9959 1.0170 1.0080 1.0126 1.0051 1.0118 1.0122 1.0006 1.0006 0.9998
dispcorr: -0.020884233 hartree
energy: -1079.753950870384
dipole: -27.51491 27.82402 0.30911 -18.35920 17.79408 -0.56512 2.41380 -2.42159 -0.00779
magnitude: 0.64418 au
magnitude: 1.63738 debye
