program: Orca
programVersion: 5.0.2
elementType: O O O C C C C C C C C C C C C C C C C C C C C C C H H H H H H H H H H H H H H H H H H H H H H H H H H
charge: 0
multiplicity: 1
keywords: wb97x-d3
keywords: def2-TZVPP
keywords: def2/J RIJCOSX
keywords: DEFGRID2
keywords: scfconv7
keywords: smallprint printgap noloewdin
keywords: NOSOSCF
formula: C22H26O3
InChI: InChI=1/C22H26O3/c1-15(2)10-19-20(22(19,3)4)21(23)25-14-17-12-18(24-13-17)11-16-8-6-5-7-9-16/h5-10,12-13,19-20H,11,14H2,1-4H3
51 atoms
O  -1.029988 0.122348 0.153949
O  -2.280753 -1.388693 -0.913809
O  2.501011 2.160622 0.728545
C  -4.627576 0.192169 0.456423
C  -4.355381 -1.079908 1.199212
C  -3.211696 -0.128875 0.897147
C  -5.022506 0.098023 -0.997768
C  -5.287927 1.35277 1.162943
C  -4.774956 -1.309474 2.592602
C  -2.164372 -0.552258 -0.056611
C  -5.146723 -2.470739 3.137681
C  -5.558675 -2.542048 4.578391
C  -5.195035 -3.784141 2.416728
C  0.072549 -0.195607 -0.684979
C  1.219818 0.658829 -0.282613
C  2.529262 0.621173 -0.857673
C  1.266906 1.612959 0.673288
C  3.260673 1.553571 -0.202895
C  4.677374 1.996003 -0.328712
C  5.393207 1.217245 -1.397606
C  6.062184 0.038123 -1.089173
C  5.357131 1.638312 -2.722123
C  6.685274 -0.703405 -2.081782
C  5.977328 0.899546 -3.718243
C  6.643735 -0.274601 -3.400015
H  -4.350917 -1.9567 0.561535
H  -2.846134 0.465514 1.727229
H  -4.598936 -0.769426 -1.497162
H  -6.109271 0.031482 -1.075673
H  -4.707765 0.988185 -1.54614
H  -4.939741 1.487765 2.186126
H  -5.087431 2.282684 0.62827
H  -6.370147 1.215719 1.197822
H  -4.777406 -0.43761 3.239954
H  -4.910465 -3.220013 5.139733
H  -6.575292 -2.930839 4.678458
H  -5.52531 -1.568104 5.065423
H  -4.57533 -4.523597 2.93042
H  -4.85395 -3.733276 1.385322
H  -6.212749 -4.183158 2.41067
H  -0.187005 -0.026158 -1.734418
H  0.328926 -1.255171 -0.590479
H  2.878566 -0.018208 -1.65227
H  0.536349 1.995277 1.365504
H  5.188978 1.875961 0.631326
H  4.712339 3.066136 -0.556371
H  6.092977 -0.305012 -0.06187
H  4.834554 2.552671 -2.977178
H  7.204536 -1.61728 -1.824441
H  5.940615 1.241766 -4.744136
H  7.130343 -0.851445 -4.175315
totalener: -1079.73338698 hartree
nucrepener: 1990.70152215 hartree
electener: -3070.43490913 hartree
oneelecener: -5419.46733076 hartree
twoeener: 2349.03242162 hartree
kineticenergy: 1074.89638961 hartree
xcener: -106.467235666762 hartree
chargesum: -0.0000000
charge: -0.267422 -0.387929 -0.256338 0.074832 0.038103 -0.059531 -0.253004 -0.256429 -0.183173 0.318323 -0.049527 -0.203094 -0.238193 0.086201 -0.005146 -0.268770 -0.054380 0.165808 -0.054649 0.019734 -0.153624 -0.158090 -0.124123 -0.122917 -0.126928 0.088047 0.070168 0.099781 0.085251 0.083650 0.072744 0.090578 0.094827 0.069931 0.084442 0.083287 0.075318 0.084634 0.086037 0.086002 0.098031 0.098267 0.140333 0.144268 0.091960 0.093075 0.110610 0.111558 0.125609 0.125508 0.126352
qa: -0.2674 -0.3879 -0.2563 0.0748 0.0381 -0.0595 -0.2530 -0.2564 -0.1832 0.3183 -0.0495 -0.2031 -0.2382 0.0862 -0.0051 -0.2688 -0.0544 0.1658 -0.0546 0.0197 -0.1536 -0.1581 -0.1241 -0.1229 -0.1269 0.0880 0.0702 0.0998 0.0853 0.0836 0.0727 0.0906 0.0948 0.0699 0.0844 0.0833 0.0753 0.0846 0.0860 0.0860 0.0980 0.0983 0.1403 0.1443 0.0920 0.0931 0.1106 0.1116 0.1256 0.1255 0.1264
va: 2.1388 2.1199 2.2963 3.7514 3.7954 3.8455 3.9120 3.9195 3.9150 4.2479 3.8293 3.9342 3.9439 3.8596 3.7206 4.0065 3.9888 3.7270 3.8686 3.6710 3.9828 3.9798 3.9604 3.9586 3.9537 1.0320 1.0331 1.0224 1.0007 1.0028 1.0106 1.0042 1.0028 1.0219 0.9984 0.9979 1.0124 0.9992 1.0161 0.9986 0.9936 0.9932 1.0066 1.0112 1.0077 1.0065 1.0111 1.0109 1.0003 1.0004 0.9996
dispcorr: -0.021001043 hartree
energy: -1079.754388024676
dipole: -29.87458 29.93592 0.06135 -8.83265 9.03875 0.20610 9.91820 -9.64139 0.27681
magnitude: 0.35052 au
magnitude: 0.89095 debye
