program: Orca
programVersion: 5.0.2
elementType: O O O C C C C C C C C C C C C C C C C C C C C C C H H H H H H H H H H H H H H H H H H H H H H H H H H
charge: 0
multiplicity: 1
keywords: wb97x-d3
keywords: def2-TZVPP
keywords: def2/J RIJCOSX
keywords: DEFGRID2
keywords: scfconv7
keywords: smallprint printgap noloewdin
keywords: NOSOSCF
formula: C22H26O3
InChI: InChI=1/C22H26O3/c1-15(2)10-19-20(22(19,3)4)21(23)25-14-17-12-18(24-13-17)11-16-8-6-5-7-9-16/h5-10,12-13,19-20H,11,14H2,1-4H3
51 atoms
O  -1.58607 2.025712 0.416489
O  -0.778447 0.78646 2.099156
O  2.179223 3.147783 -1.386265
C  -1.2880 -1.485699 -0.002583
C  -2.310143 -1.553229 1.083847
C  -2.072855 -0.237216 0.372287
C  0.171903 -1.61343 0.36572
C  -1.595907 -2.0598 -1.365271
C  -3.608512 -2.252308 0.937708
C  -1.412428 0.877097 1.078616
C  -4.61716 -2.185628 1.808732
C  -5.887074 -2.951092 1.589478
C  -4.581925 -1.355012 3.055849
C  -0.75858 3.132935 0.789264
C  0.572823 3.001033 0.13741
C  1.641391 2.121818 0.499341
C  0.966851 3.594335 -1.014155
C  2.583256 2.245274 -0.464264
C  3.855502 1.513622 -0.719033
C  3.599996 0.104551 -1.203567
C  2.925446 -0.117891 -2.401574
C  4.000566 -0.991821 -0.451019
C  2.658998 -1.406565 -2.833668
C  3.736506 -2.285214 -0.882081
C  3.063393 -2.496437 -2.073767
H  -1.882261 -1.578182 2.081631
H  -2.820656 0.064932 -0.351796
H  0.37961 -1.292132 1.383161
H  0.479375 -2.657121 0.278754
H  0.80358 -1.031723 -0.308938
H  -1.417598 -3.137038 -1.379495
H  -2.625465 -1.887205 -1.678452
H  -0.944375 -1.608828 -2.115625
H  -3.737954 -2.875206 0.057838
H  -5.869929 -3.516099 0.658103
H  -6.749882 -2.280842 1.560187
H  -6.069239 -3.65563 2.405087
H  -3.663509 -0.782107 3.166077
H  -4.698253 -1.980746 3.944415
H  -5.414581 -0.647126 3.066206
H  -0.674452 3.207538 1.873926
H  -1.281464 4.016914 0.425698
H  1.679652 1.463801 1.351273
H  0.500676 4.326427 -1.653916
H  4.446675 1.48283 0.198318
H  4.452176 2.063064 -1.451343
H  2.600381 0.725647 -2.998861
H  4.522217 -0.836088 0.485858
H  2.134316 -1.561942 -3.767496
H  4.054416 -3.127109 -0.281099
H  2.854181 -3.503121 -2.410671
totalener: -1079.72995183 hartree
nucrepener: 2182.69070030 hartree
electener: -3262.42065214 hartree
oneelecener: -5803.85781228 hartree
twoeener: 2541.43716015 hartree
kineticenergy: 1074.90794215 hartree
xcener: -106.467018237132 hartree
chargesum: -0.0000000
charge: -0.261235 -0.400286 -0.254710 0.184684 -0.061036 -0.053734 -0.261218 -0.293632 -0.200439 0.336772 -0.012768 -0.215902 -0.237240 0.051386 -0.045173 -0.309947 -0.035610 0.258060 -0.103500 0.005079 -0.125098 -0.128064 -0.147408 -0.130432 -0.124867 0.099776 0.075692 0.099837 0.085027 0.064060 0.094985 0.075567 0.091613 0.091371 0.076558 0.083766 0.085462 0.082024 0.087037 0.083007 0.114885 0.094454 0.151282 0.135230 0.094598 0.108276 0.113932 0.105108 0.124909 0.123856 0.124007
qa: -0.2612 -0.4003 -0.2547 0.1847 -0.0610 -0.0537 -0.2612 -0.2936 -0.2004 0.3368 -0.0128 -0.2159 -0.2372 0.0514 -0.0452 -0.3099 -0.0356 0.2581 -0.1035 0.0051 -0.1251 -0.1281 -0.1474 -0.1304 -0.1249 0.0998 0.0757 0.0998 0.0850 0.0641 0.0950 0.0756 0.0916 0.0914 0.0766 0.0838 0.0855 0.0820 0.0870 0.0830 0.1149 0.0945 0.1513 0.1352 0.0946 0.1083 0.1139 0.1051 0.1249 0.1239 0.1240
va: 2.1265 2.0953 2.3029 3.7335 3.8592 3.8344 3.8975 3.9181 3.9006 4.2230 3.7470 3.9426 3.9491 3.9059 3.7343 3.9796 3.9794 3.5587 3.8393 3.7439 3.9233 3.9438 3.9388 3.9529 3.9154 1.0215 1.0362 1.0225 1.0063 1.0042 0.9992 1.0075 1.0070 1.0108 1.0105 0.9983 0.9977 1.0193 0.9997 1.0002 1.0086 0.9965 1.0197 1.0069 1.0096 1.0128 1.0190 1.0115 1.0016 1.0013 1.0005
dispcorr: -0.026663656 hartree
energy: -1079.756615489622
dipole: -17.60710 17.50228 -0.10483 -19.07908 18.98565 -0.09343 4.10795 -4.57721 -0.46926
magnitude: 0.48982 au
magnitude: 1.24502 debye
