program: Orca
programVersion: 5.0.2
elementType: O O O C C C C C C C C C C C C C C C C C C C C C C H H H H H H H H H H H H H H H H H H H H H H H H H H
charge: 0
multiplicity: 1
keywords: wb97x-d3
keywords: def2-TZVPP
keywords: def2/J RIJCOSX
keywords: DEFGRID2
keywords: scfconv7
keywords: smallprint printgap noloewdin
keywords: NOSOSCF
formula: C22H26O3
InChI: InChI=1/C22H26O3/c1-15(2)10-19-20(22(19,3)4)21(23)25-14-17-12-18(24-13-17)11-16-8-6-5-7-9-16/h5-10,12-13,19-20H,11,14H2,1-4H3
51 atoms
O  -1.602098 2.017652 0.521187
O  -0.71931 0.757358 2.148873
O  2.156919 2.975826 -1.3799
C  -1.389858 -1.403774 -0.082657
C  -2.212281 -1.59842 1.148974
C  -2.155792 -0.231232 0.514943
C  0.114696 -1.472404 0.024753
C  -1.912662 -1.908301 -1.405489
C  -3.474504 -2.382498 1.144205
C  -1.418085 0.865971 1.173757
C  -4.536891 -2.128698 1.909363
C  -5.758519 -2.99597 1.866899
C  -4.60049 -0.981535 2.870447
C  -0.735278 3.108425 0.851703
C  0.583406 2.932455 0.184036
C  1.675063 2.104837 0.596209
C  0.944323 3.431884 -1.021849
C  2.595273 2.160977 -0.393858
C  3.867472 1.42318 -0.623519
C  3.614321 0.049825 -1.203684
C  3.100681 -0.091536 -2.490353
C  3.852086 -1.093448 -0.451333
C  2.831548 -1.347903 -3.008929
C  3.585052 -2.353589 -0.968592
C  3.072377 -2.484414 -2.249038
H  -1.629333 -1.673062 2.06393
H  -3.022491 0.083372 -0.056028
H  0.60072 -0.858398 -0.735975
H  0.484131 -1.153012 0.996475
H  0.44645 -2.500655 -0.130322
H  -1.645248 -2.957236 -1.550836
H  -2.996731 -1.827698 -1.486127
H  -1.473895 -1.34073 -2.227724
H  -3.509576 -3.247496 0.487517
H  -5.955654 -3.444914 2.843572
H  -5.663549 -3.802259 1.140577
H  -6.64596 -2.412512 1.60883
H  -4.793877 -1.340807 3.884368
H  -5.425282 -0.309586 2.618984
H  -3.684889 -0.394705 2.895945
H  -0.630482 3.207268 1.932715
H  -1.243106 3.995952 0.475875
H  1.741206 1.524658 1.501092
H  0.45337 4.100783 -1.710418
H  4.399005 1.327867 0.324801
H  4.516663 2.001084 -1.286076
H  2.905264 0.788822 -3.090696
H  4.248258 -1.000425 0.552941
H  2.433263 -1.441162 -4.010931
H  3.777148 -3.232784 -0.367445
H  2.862547 -3.465391 -2.654587
totalener: -1079.72989099 hartree
nucrepener: 2188.42967092 hartree
electener: -3268.15956191 hartree
oneelecener: -5815.39918860 hartree
twoeener: 2547.23962669 hartree
kineticenergy: 1074.91265519 hartree
xcener: -106.467385250965 hartree
chargesum: 0.0000000
charge: -0.258434 -0.393982 -0.255508 0.185471 -0.024626 -0.121617 -0.273131 -0.285594 -0.240263 0.351960 -0.006218 -0.212106 -0.224439 0.049859 -0.040597 -0.314763 -0.035085 0.264286 -0.113964 0.026476 -0.147755 -0.133299 -0.125707 -0.132165 -0.131523 0.105748 0.082137 0.083022 0.091965 0.085354 0.088620 0.085204 0.092297 0.092099 0.086528 0.078056 0.083537 0.088245 0.084365 0.081919 0.113260 0.095823 0.147585 0.134932 0.093282 0.108761 0.113422 0.104225 0.124074 0.123966 0.124299
qa: -0.2584 -0.3940 -0.2555 0.1855 -0.0246 -0.1216 -0.2731 -0.2856 -0.2403 0.3520 -0.0062 -0.2121 -0.2244 0.0499 -0.0406 -0.3148 -0.0351 0.2643 -0.1140 0.0265 -0.1478 -0.1333 -0.1257 -0.1322 -0.1315 0.1057 0.0821 0.0830 0.0920 0.0854 0.0886 0.0852 0.0923 0.0921 0.0865 0.0781 0.0835 0.0882 0.0844 0.0819 0.1133 0.0958 0.1476 0.1349 0.0933 0.1088 0.1134 0.1042 0.1241 0.1240 0.1243
va: 2.1269 2.1045 2.3010 3.7378 3.8326 3.8444 3.8966 3.9047 3.8997 4.2073 3.7329 3.9414 3.9404 3.9071 3.7162 3.9858 3.9884 3.5421 3.8523 3.7030 3.9561 3.9391 3.9439 3.9340 3.9290 1.0252 1.0333 0.9980 1.0202 1.0050 1.0014 1.0053 1.0064 1.0092 0.9984 1.0097 0.9993 1.0019 1.0009 1.0210 1.0074 0.9965 1.0226 1.0071 1.0124 1.0120 1.0210 1.0116 1.0008 1.0013 1.0003
dispcorr: -0.027103995 hartree
energy: -1079.756994980768
dipole: -18.07007 17.90350 -0.16657 -17.77656 17.73235 -0.04421 3.40773 -3.87641 -0.46868
magnitude: 0.49936 au
magnitude: 1.26928 debye
