program: Orca
programVersion: 5.0.2
elementType: O O O C C C C C C C C C C C C C C C C C C C C C C H H H H H H H H H H H H H H H H H H H H H H H H H H
charge: 0
multiplicity: 1
keywords: wb97x-d3
keywords: def2-TZVPP
keywords: def2/J RIJCOSX
keywords: DEFGRID2
keywords: scfconv7
keywords: smallprint printgap noloewdin
keywords: NOSOSCF
formula: C22H26O3
InChI: InChI=1/C22H26O3/c1-15(2)10-19-20(22(19,3)4)21(23)25-14-17-12-18(24-13-17)11-16-8-6-5-7-9-16/h5-10,12-13,19-20H,11,14H2,1-4H3
51 atoms
O  -1.181683 1.088126 0.062966
O  -3.23724 1.963901 0.048871
O  3.000727 2.406687 0.226802
C  -3.840066 -0.689497 1.657951
C  -4.369477 -0.78485 0.266714
C  -2.929672 -0.372178 0.48222
C  -4.343887 0.412336 2.557851
C  -3.510252 -1.961342 2.402672
C  -4.691269 -2.092384 -0.361809
C  -2.509403 1.01302 0.178928
C  -4.531498 -2.390131 -1.652034
C  -4.909049 -3.735361 -2.194205
C  -3.977929 -1.426555 -2.657397
C  -0.627779 2.376712 -0.213903
C  0.846379 2.225477 -0.269266
C  1.612169 1.489141 -1.227487
C  1.752218 2.753181 0.58504
C  2.91081 1.634028 -0.875316
C  4.173961 1.08249 -1.428667
C  4.823135 0.085847 -0.497135
C  6.043919 0.355906 0.105658
C  4.190012 -1.121477 -0.217975
C  6.626316 -0.56256 0.96886
C  4.76833 -2.041298 0.64041
C  5.990747 -1.763872 1.237445
H  -5.014811 0.041408 -0.022881
H  -2.17571 -1.123262 0.275398
H  -4.618001 1.311537 2.011695
H  -5.228777 0.068169 3.096675
H  -3.592337 0.684753 3.301483
H  -4.399234 -2.363275 2.893698
H  -3.112813 -2.738043 1.74927
H  -2.76618 -1.768373 3.177206
H  -5.11863 -2.850431 0.289279
H  -5.680476 -3.64804 -2.963484
H  -5.285274 -4.400022 -1.417305
H  -4.052486 -4.222309 -2.667349
H  -3.747973 -0.452335 -2.231837
H  -4.68832 -1.273514 -3.473944
H  -3.065274 -1.821137 -3.11225
H  -0.917812 3.090872 0.560625
H  -1.021972 2.752632 -1.161732
H  1.235604 0.922382 -2.063895
H  1.652833 3.377404 1.458511
H  4.874915 1.891525 -1.652099
H  3.940263 0.606058 -2.383277
H  6.545248 1.294737 -0.097276
H  3.228988 -1.337517 -0.670194
H  7.577323 -0.335771 1.432878
H  4.264054 -2.976416 0.846127
H  6.442964 -2.480685 1.90999
totalener: -1079.73213213 hartree
nucrepener: 2041.87803711 hartree
electener: -3121.61016925 hartree
oneelecener: -5521.89435194 hartree
twoeener: 2400.28418270 hartree
kineticenergy: 1074.90941201 hartree
xcener: -106.464182253456 hartree
chargesum: 0.0000000
charge: -0.249992 -0.389121 -0.248915 0.123317 -0.018562 -0.095532 -0.261382 -0.273420 -0.232685 0.320340 -0.006846 -0.210507 -0.227955 0.057449 -0.026237 -0.266907 -0.029351 0.208074 -0.130711 0.063185 -0.144397 -0.154516 -0.123630 -0.129063 -0.131284 0.105237 0.084483 0.101600 0.084414 0.085913 0.089707 0.084287 0.091769 0.092480 0.087238 0.078696 0.082998 0.083566 0.090678 0.084685 0.090100 0.101237 0.128279 0.136660 0.094848 0.110044 0.105180 0.112208 0.123690 0.124049 0.124604
qa: -0.2500 -0.3891 -0.2489 0.1233 -0.0186 -0.0955 -0.2614 -0.2734 -0.2327 0.3203 -0.0068 -0.2105 -0.2280 0.0574 -0.0262 -0.2669 -0.0294 0.2081 -0.1307 0.0632 -0.1444 -0.1545 -0.1236 -0.1291 -0.1313 0.1052 0.0845 0.1016 0.0844 0.0859 0.0897 0.0843 0.0918 0.0925 0.0872 0.0787 0.0830 0.0836 0.0907 0.0847 0.0901 0.1012 0.1283 0.1367 0.0948 0.1100 0.1052 0.1122 0.1237 0.1240 0.1246
va: 2.1246 2.1133 2.3123 3.7490 3.8138 3.8371 3.9005 3.9107 3.8996 4.2054 3.7374 3.9414 3.9415 3.8751 3.7337 4.0276 3.9827 3.6372 3.8875 3.6489 4.0019 3.9927 3.9623 3.9733 3.9607 1.0268 1.0305 1.0206 1.0023 1.0017 1.0011 1.0051 1.0064 1.0094 0.9986 1.0098 0.9992 1.0167 1.0016 1.0006 1.0062 0.9939 1.0178 1.0079 1.0117 1.0049 1.0117 1.0121 1.0006 1.0006 0.9998
dispcorr: -0.021825646 hartree
energy: -1079.753957776553
dipole: -22.81198 23.24881 0.43683 -16.80416 16.18818 -0.61599 -0.73421 0.58488 -0.14932
magnitude: 0.76978 au
magnitude: 1.95662 debye
