program: Orca
programVersion: 5.0.2
elementType: O O O C C C C C C C C C C C C C C C C C C C C C C H H H H H H H H H H H H H H H H H H H H H H H H H H
charge: 0
multiplicity: 1
keywords: wb97x-d3
keywords: def2-TZVPP
keywords: def2/J RIJCOSX
keywords: DEFGRID2
keywords: scfconv7
keywords: smallprint printgap noloewdin
keywords: NOSOSCF
formula: C22H26O3
InChI: InChI=1/C22H26O3/c1-15(2)10-19-20(22(19,3)4)21(23)25-14-17-12-18(24-13-17)11-16-8-6-5-7-9-16/h5-10,12-13,19-20H,11,14H2,1-4H3
51 atoms
O  -1.241051 1.014412 -0.217748
O  -2.98374 0.857076 -1.608657
O  2.442761 3.311443 0.306895
C  -4.447664 0.135108 1.09491
C  -4.253317 -1.084481 0.258675
C  -3.068112 -0.189681 0.54342
C  -5.245628 1.287335 0.535556
C  -4.595353 -0.021872 2.589699
C  -4.32011 -2.452218 0.836081
C  -2.465383 0.600893 -0.551856
C  -3.53572 -3.474265 0.491652
C  -3.689893 -4.825374 1.121719
C  -2.450585 -3.369272 -0.535448
C  -0.544175 1.815822 -1.175591
C  0.782682 2.157668 -0.605705
C  1.918271 1.300278 -0.45192
C  1.170306 3.360923 -0.124945
C  2.894467 2.053456 0.105888
C  4.291413 1.760034 0.53084
C  4.792313 0.461999 -0.042713
C  5.115898 0.37354 -1.393964
C  4.931226 -0.668769 0.751502
C  5.572568 -0.816269 -1.935917
C  5.38901 -1.86374 0.212535
C  5.711647 -1.940212 -1.132662
H  -4.627748 -0.992182 -0.758436
H  -2.35714 -0.54797 1.279196
H  -5.175102 1.364179 -0.546514
H  -6.299277 1.161968 0.792018
H  -4.915094 2.235858 0.963364
H  -3.993926 -0.840635 2.984393
H  -4.288992 0.8912 3.102544
H  -5.63634 -0.216213 2.856709
H  -5.09302 -2.626283 1.579575
H  -3.932031 -5.583507 0.372982
H  -4.474217 -4.838436 1.877354
H  -2.759171 -5.144903 1.597176
H  -1.469066 -3.527932 -0.081093
H  -2.434347 -2.407367 -1.04236
H  -2.56742 -4.143829 -1.297087
H  -1.115951 2.720284 -1.397109
H  -0.437731 1.26472 -2.113075
H  1.994006 0.260582 -0.726086
H  0.662782 4.308259 -0.037539
H  4.349945 1.730483 1.623552
H  4.944125 2.581082 0.218804
H  5.004899 1.246022 -2.026878
H  4.680318 -0.616528 1.804177
H  5.82285 -0.867066 -2.987481
H  5.493708 -2.734434 0.846455
H  6.071324 -2.869242 -1.554919
totalener: -1079.73232370 hartree
nucrepener: 2044.28619046 hartree
electener: -3124.01851415 hartree
oneelecener: -5526.72469373 hartree
twoeener: 2402.70617958 hartree
kineticenergy: 1074.90498035 hartree
xcener: -106.464324629347 hartree
chargesum: 0.0000000
charge: -0.247763 -0.389643 -0.255379 0.121862 -0.012964 -0.100587 -0.260729 -0.272566 -0.239141 0.319758 -0.004025 -0.212031 -0.226076 0.057145 -0.043214 -0.227232 -0.028280 0.164425 -0.063378 0.013317 -0.172156 -0.139441 -0.112534 -0.122370 -0.131591 0.104746 0.086576 0.101308 0.083607 0.085264 0.085295 0.091574 0.088732 0.091990 0.087113 0.078456 0.083901 0.088595 0.082478 0.088920 0.091289 0.099328 0.138458 0.136100 0.086517 0.103988 0.115676 0.107971 0.126128 0.124815 0.125768
qa: -0.2478 -0.3896 -0.2554 0.1219 -0.0130 -0.1006 -0.2607 -0.2726 -0.2391 0.3198 -0.0040 -0.2120 -0.2261 0.0571 -0.0432 -0.2272 -0.0283 0.1644 -0.0634 0.0133 -0.1722 -0.1394 -0.1125 -0.1224 -0.1316 0.1047 0.0866 0.1013 0.0836 0.0853 0.0853 0.0916 0.0887 0.0920 0.0871 0.0785 0.0839 0.0886 0.0825 0.0889 0.0913 0.0993 0.1385 0.1361 0.0865 0.1040 0.1157 0.1080 0.1261 0.1248 0.1258
va: 2.1217 2.1118 2.3029 3.7477 3.8094 3.8429 3.9020 3.9099 3.9024 4.2065 3.7337 3.9420 3.9417 3.8805 3.7507 3.9892 3.9770 3.6847 3.8456 3.6740 3.9879 3.9726 3.9458 3.9622 3.9590 1.0275 1.0299 1.0207 1.0027 1.0014 1.0052 1.0063 1.0017 1.0098 0.9987 1.0097 0.9989 1.0005 1.0169 1.0023 1.0051 0.9956 1.0102 1.0087 1.0082 1.0061 1.0089 1.0117 0.9997 1.0005 0.9998
dispcorr: -0.021993319 hartree
energy: -1079.754317018735
dipole: -20.91364 21.44127 0.52763 -16.97147 16.61635 -0.35512 7.10312 -6.57641 0.52671
magnitude: 0.82579 au
magnitude: 2.09898 debye
