program: Orca
programVersion: 5.0.2
elementType: O O O C C C C C C C C C C C C C C C C C C C C C C H H H H H H H H H H H H H H H H H H H H H H H H H H
charge: 0
multiplicity: 1
keywords: wb97x-d3
keywords: def2-TZVPP
keywords: def2/J RIJCOSX
keywords: DEFGRID2
keywords: scfconv7
keywords: smallprint printgap noloewdin
keywords: NOSOSCF
formula: C22H26O3
InChI: InChI=1/C22H26O3/c1-15(2)10-19-20(22(19,3)4)21(23)25-14-17-12-18(24-13-17)11-16-8-6-5-7-9-16/h5-10,12-13,19-20H,11,14H2,1-4H3
51 atoms
O  -2.099653 1.990953 -0.251617
O  -1.733328 1.884738 1.951407
O  2.078082 2.128858 -1.513973
C  -4.059249 -0.352728 0.151239
C  -2.727236 -0.826739 -0.322314
C  -2.811603 0.062379 0.908225
C  -4.832457 0.635767 -0.688176
C  -4.955167 -1.320097 0.889955
C  -2.263682 -2.231735 -0.191018
C  -2.180915 1.398109 0.945424
C  -0.99563 -2.585976 0.02755
C  -0.591997 -4.02488 0.137247
C  0.119722 -1.599882 0.194289
C  -1.245025 3.132594 -0.36576
C  0.171036 2.708107 -0.538638
C  1.092959 2.262692 0.46293
C  0.83381 2.597009 -1.713716
C  2.229933 1.922158 -0.186915
C  3.524921 1.352708 0.273174
C  3.62459 -0.141537 0.066044
C  3.600143 -1.007968 1.152244
C  3.733283 -0.679102 -1.213793
C  3.680269 -2.381235 0.970136
C  3.809829 -2.050387 -1.3997
C  3.782359 -2.907466 -0.30794
H  -2.36239 -0.309555 -1.205504
H  -2.678185 -0.445397 1.856472
H  -5.454443 1.278142 -0.06194
H  -4.191667 1.273013 -1.291104
H  -5.496488 0.097665 -1.367444
H  -4.393676 -2.015543 1.513713
H  -5.649731 -0.782462 1.537508
H  -5.547263 -1.909758 0.186907
H  -3.010643 -3.012409 -0.305688
H  -0.11605 -4.222469 1.101225
H  0.143504 -4.283611 -0.628488
H  -1.439871 -4.701431 0.035064
H  0.515845 -1.635996 1.212104
H  -0.172527 -0.572455 -0.009297
H  0.958344 -1.841085 -0.462576
H  -1.363921 3.791684 0.494662
H  -1.596261 3.662134 -1.250935
H  0.914235 2.200637 1.52347
H  0.554635 2.816446 -2.731898
H  3.635424 1.583363 1.333657
H  4.350823 1.855172 -0.238846
H  3.516002 -0.605305 2.154794
H  3.757561 -0.021401 -2.073768
H  3.660715 -3.039073 1.829281
H  3.89434 -2.451982 -2.401151
H  3.844605 -3.977804 -0.453946
totalener: -1079.72850172 hartree
nucrepener: 2216.21049401 hartree
electener: -3295.93899574 hartree
oneelecener: -5870.78104992 hartree
twoeener: 2574.84205419 hartree
kineticenergy: 1074.90774013 hartree
xcener: -106.467746929962 hartree
chargesum: -0.0000000
charge: -0.267004 -0.377044 -0.260018 0.146809 -0.001857 -0.100404 -0.257378 -0.280303 -0.253112 0.332874 0.031832 -0.227963 -0.197592 0.026147 -0.039431 -0.301353 -0.029061 0.256659 -0.117867 0.070518 -0.180993 -0.159265 -0.095986 -0.111884 -0.158061 0.095522 0.083779 0.090358 0.088307 0.082373 0.084786 0.092955 0.088978 0.091169 0.083414 0.085796 0.080357 0.088665 0.051081 0.078804 0.118876 0.089819 0.150406 0.134096 0.089676 0.110019 0.106841 0.112830 0.124480 0.124138 0.124209
qa: -0.2670 -0.3770 -0.2600 0.1468 -0.0019 -0.1004 -0.2574 -0.2803 -0.2531 0.3329 0.0318 -0.2280 -0.1976 0.0261 -0.0394 -0.3014 -0.0291 0.2567 -0.1179 0.0705 -0.1810 -0.1593 -0.0960 -0.1119 -0.1581 0.0955 0.0838 0.0904 0.0883 0.0824 0.0848 0.0930 0.0890 0.0912 0.0834 0.0858 0.0804 0.0887 0.0511 0.0788 0.1189 0.0898 0.1504 0.1341 0.0897 0.1100 0.1068 0.1128 0.1245 0.1241 0.1242
va: 2.0839 2.1265 2.3012 3.7157 3.7919 3.8263 3.8948 3.9171 3.8875 4.2073 3.7501 3.9425 3.9567 3.9251 3.6903 4.0001 3.9894 3.5674 3.8620 3.6421 3.9538 3.9875 3.9004 3.9228 3.9432 1.0283 1.0314 1.0025 1.0188 1.0027 1.0052 1.0055 1.0007 1.0098 0.9990 0.9997 1.0112 1.0009 1.0322 1.0038 1.0066 0.9996 1.0236 1.0072 1.0155 1.0055 1.0118 1.0235 1.0001 1.0012 1.0018
dispcorr: -0.028222492 hartree
energy: -1079.756724216786
dipole: -12.94800 13.09259 0.14459 -16.55592 16.24392 -0.31200 0.69449 -1.31593 -0.62144
magnitude: 0.71024 au
magnitude: 1.80529 debye
