program: Orca
programVersion: 5.0.2
elementType: O O O C C C C C C C C C C C C C C C C C C C C C C H H H H H H H H H H H H H H H H H H H H H H H H H H
charge: 0
multiplicity: 1
keywords: wb97x-d3
keywords: def2-TZVPP
keywords: def2/J RIJCOSX
keywords: DEFGRID2
keywords: scfconv7
keywords: smallprint printgap noloewdin
keywords: NOSOSCF
formula: C22H26O3
InChI: InChI=1/C22H26O3/c1-15(2)10-19-20(22(19,3)4)21(23)25-14-17-12-18(24-13-17)11-16-8-6-5-7-9-16/h5-10,12-13,19-20H,11,14H2,1-4H3
51 atoms
O  -1.91946 2.278156 0.816294
O  -1.960447 1.733343 -1.353553
O  2.33732 2.093471 0.956884
C  -3.648962 -0.735012 -0.461748
C  -2.202809 -1.097599 -0.407282
C  -2.690511 0.159324 0.295715
C  -4.253388 -0.297676 -1.773457
C  -4.613988 -1.505338 0.409031
C  -1.69877 -2.256993 0.371332
C  -2.180653 1.451726 -0.203149
C  -0.65425 -2.25144 1.202201
C  -0.238408 -3.498014 1.923333
C  0.180863 -1.043758 1.498975
C  -1.055932 3.389436 0.548167
C  0.347285 2.910263 0.41059
C  1.001335 2.439231 -0.771937
C  1.217709 2.673662 1.421098
C  2.199128 1.948245 -0.37886
C  3.263257 1.206739 -1.104335
C  3.141753 -0.284737 -0.88618
C  4.016958 -0.962572 -0.047993
C  2.113369 -0.995973 -1.498041
C  3.874812 -2.32675 0.170032
C  1.966859 -2.356048 -1.283398
C  2.850596 -3.026848 -0.448186
H  -1.659543 -0.888358 -1.326706
H  -2.753812 0.094479 1.37559
H  -3.543317 0.215914 -2.415468
H  -4.626789 -1.170654 -2.312576
H  -5.099562 0.371729 -1.60754
H  -4.952731 -2.410781 -0.098862
H  -4.168672 -1.806311 1.357324
H  -5.496001 -0.902193 0.630865
H  -2.22674 -3.195189 0.219654
H  -0.884886 -4.344426 1.693763
H  -0.252702 -3.347336 3.005881
H  0.786953 -3.770759 1.661661
H  -0.019978 -0.20317 0.840185
H  1.242185 -1.283463 1.406885
H  0.022247 -0.70948 2.528287
H  -1.16701 4.043272 1.412439
H  -1.383451 3.936051 -0.337001
H  0.607432 2.448544 -1.774426
H  1.169155 2.855571 2.482826
H  4.252403 1.553729 -0.795454
H  3.171052 1.436276 -2.167735
H  4.81757 -0.420634 0.44103
H  1.41098 -0.475291 -2.138718
H  4.566618 -2.84141 0.824166
H  1.156578 -2.892541 -1.758626
H  2.739575 -4.090444 -0.281612
totalener: -1079.72954668 hartree
nucrepener: 2270.91494046 hartree
electener: -3350.64448714 hartree
oneelecener: -5980.32344392 hartree
twoeener: 2629.67895678 hartree
kineticenergy: 1074.91781690 hartree
xcener: -106.470972456986 hartree
chargesum: -0.0000000
charge: -0.262559 -0.401744 -0.244425 0.144564 -0.019971 -0.102725 -0.261128 -0.269974 -0.254631 0.332620 -0.000969 -0.212314 -0.182503 0.055279 -0.075991 -0.238645 -0.035706 0.205719 -0.129450 0.080436 -0.148041 -0.173299 -0.096448 -0.090865 -0.195928 0.093714 0.088864 0.100884 0.080146 0.083520 0.087884 0.085933 0.091383 0.091981 0.078048 0.088153 0.083632 0.039742 0.091598 0.102662 0.101838 0.111243 0.142240 0.133623 0.096070 0.112241 0.105971 0.110868 0.123913 0.121171 0.131376
qa: -0.2626 -0.4017 -0.2444 0.1446 -0.0200 -0.1027 -0.2611 -0.2700 -0.2546 0.3326 -0.0010 -0.2123 -0.1825 0.0553 -0.0760 -0.2386 -0.0357 0.2057 -0.1295 0.0804 -0.1480 -0.1733 -0.0964 -0.0909 -0.1959 0.0937 0.0889 0.1009 0.0801 0.0835 0.0879 0.0859 0.0914 0.0920 0.0780 0.0882 0.0836 0.0397 0.0916 0.1027 0.1018 0.1112 0.1422 0.1336 0.0961 0.1122 0.1060 0.1109 0.1239 0.1212 0.1314
va: 2.1162 2.0896 2.2977 3.7326 3.8175 3.8443 3.8954 3.9060 3.8441 4.2009 3.7645 3.9352 3.9130 3.8978 3.7094 3.9844 3.9605 3.6198 3.8797 3.5977 4.0070 3.9406 3.9178 3.8735 3.9328 1.0265 1.0311 1.0242 1.0015 1.0027 1.0026 1.0056 1.0061 1.0113 1.0097 1.0004 1.0020 1.0220 0.9996 1.0081 0.9957 1.0076 1.0230 1.0072 1.0158 1.0070 1.0129 1.0134 1.0006 1.0050 0.9989
dispcorr: -0.030631406 hartree
energy: -1079.760178084523
dipole: -11.42509 11.64405 0.21896 -16.76095 16.53299 -0.22796 2.88099 -2.36325 0.51774
magnitude: 0.60660 au
magnitude: 1.54185 debye
