program: Orca
programVersion: 5.0.2
elementType: O O O C C C C C C C C C C C C C C C C C C C C C C H H H H H H H H H H H H H H H H H H H H H H H H H H
charge: 0
multiplicity: 1
keywords: wb97x-d3
keywords: def2-TZVPP
keywords: def2/J RIJCOSX
keywords: DEFGRID2
keywords: scfconv7
keywords: smallprint printgap noloewdin
keywords: NOSOSCF
formula: C22H26O3
InChI: InChI=1/C22H26O3/c1-15(2)10-19-20(22(19,3)4)21(23)25-14-17-12-18(24-13-17)11-16-8-6-5-7-9-16/h5-10,12-13,19-20H,11,14H2,1-4H3
51 atoms
O  -1.920466 2.398438 0.730019
O  -1.757309 1.38655 -1.253218
O  2.366754 2.05921 0.852766
C  -3.955057 -0.54062 -0.196102
C  -2.628457 -1.112916 0.187678
C  -2.960936 0.340248 0.53309
C  -4.252114 -0.339359 -1.662817
C  -5.188566 -0.907964 0.596301
C  -2.447801 -2.102164 1.265495
C  -2.171467 1.40092 -0.11732
C  -1.409273 -2.932034 1.414918
C  -1.37265 -3.912333 2.548276
C  -0.211824 -2.981096 0.515372
C  -0.990466 3.41212 0.311999
C  0.403028 2.888544 0.235717
C  1.168495 2.574017 -0.933122
C  1.190399 2.553421 1.285579
C  2.35069 2.077383 -0.501759
C  3.529491 1.512641 -1.206506
C  3.633109 0.017202 -1.015032
C  2.711764 -0.832416 -1.62428
C  4.625352 -0.535421 -0.213428
C  2.78608 -2.204934 -1.441328
C  4.700268 -1.910504 -0.024705
C  3.781009 -2.749094 -0.637269
H  -1.93843 -1.198316 -0.644535
H  -3.196186 0.529972 1.574426
H  -3.359837 -0.215621 -2.270966
H  -4.787781 -1.211103 -2.044387
H  -4.891837 0.531516 -1.821002
H  -5.012363 -0.948605 1.670471
H  -5.978534 -0.173612 0.42778
H  -5.571739 -1.881762 0.284338
H  -3.238481 -2.154123 2.008009
H  -0.492435 -3.753693 3.177347
H  -1.304127 -4.938716 2.17659
H  -2.256409 -3.845019 3.182945
H  -0.217531 -2.224169 -0.266908
H  -0.122871 -3.959322 0.034454
H  0.702358 -2.841212 1.098601
H  -1.078418 4.182299 1.076636
H  -1.298862 3.850314 -0.638253
H  0.868739 2.701781 -1.96135
H  1.04841 2.608349 2.354272
H  4.447899 1.995232 -0.861283
H  3.428834 1.750984 -2.267138
H  1.928553 -0.415902 -2.247874
H  5.349147 0.112889 0.266747
H  2.067145 -2.852425 -1.927564
H  5.479857 -2.325048 0.602061
H  3.838994 -3.820418 -0.492718
elementType: O C H
totalener: -1079.75271483 hartree
nucrepener: 2165.89451368 hartree
electener: -3245.64722851 hartree
oneelecener: -5771.50316813 hartree
twoeener: 2525.85593961 hartree
cpcmener: -0.02534939 hartree
kineticenergy: 1074.86081420 hartree
xcener: -106.461638971951 hartree
chargesum: -0.0000000
charge: -0.288821 -0.478076 -0.274906 0.121298 -0.002859 -0.076818 -0.277423 -0.289744 -0.256967 0.400455 -0.031134 -0.223305 -0.254509 0.084623 -0.081531 -0.299311 -0.042597 0.191867 -0.061286 0.036616 -0.166685 -0.186016 -0.204954 -0.152736 -0.156703 0.102608 0.088061 0.091800 0.093630 0.096844 0.089925 0.097363 0.100716 0.113300 0.093617 0.093096 0.087818 0.077878 0.099819 0.094101 0.122273 0.117843 0.157523 0.173208 0.107253 0.116272 0.142984 0.139541 0.160636 0.156407 0.157007
qa: -0.2888 -0.4781 -0.2749 0.1213 -0.0029 -0.0768 -0.2774 -0.2897 -0.2570 0.4005 -0.0311 -0.2233 -0.2545 0.0846 -0.0815 -0.2993 -0.0426 0.1919 -0.0613 0.0366 -0.1667 -0.1860 -0.2050 -0.1527 -0.1567 0.1026 0.0881 0.0918 0.0936 0.0968 0.0899 0.0974 0.1007 0.1133 0.0936 0.0931 0.0878 0.0779 0.0998 0.0941 0.1223 0.1178 0.1575 0.1732 0.1073 0.1163 0.1430 0.1395 0.1606 0.1564 0.1570
va: 2.1240 2.0273 2.2755 3.7008 3.8189 3.7971 3.8900 3.9179 3.8927 4.1726 3.7916 3.9212 3.9410 3.8339 3.6323 3.9918 3.9662 3.6398 3.8234 3.6025 3.8964 3.9485 3.8980 3.9011 3.8675 1.0168 1.0349 1.0224 0.9997 1.0000 1.0057 1.0013 0.9999 1.0113 0.9968 0.9953 1.0088 1.0100 0.9961 0.9960 0.9947 1.0054 1.0141 0.9950 1.0086 1.0065 1.0043 1.0040 0.9877 0.9905 0.9909
dispcorr: -0.024352175 hartree
energy: -1079.777067004577
dipole: -14.84702 14.71949 -0.12754 -18.95158 18.85097 -0.10061 2.36867 -1.76559 0.60307
magnitude: 0.62457 au
magnitude: 1.58753 debye
