program: Orca
programVersion: 5.0.2
elementType: O O O C C C C C C C C C C C C C C C C C C C C C C H H H H H H H H H H H H H H H H H H H H H H H H H H
charge: 0
multiplicity: 1
keywords: wb97x-d3
keywords: def2-TZVPP
keywords: def2/J RIJCOSX
keywords: DEFGRID2
keywords: scfconv7
keywords: smallprint printgap noloewdin
keywords: NOSOSCF
formula: C22H26O3
InChI: InChI=1/C22H26O3/c1-15(2)10-19-20(22(19,3)4)21(23)25-14-17-12-18(24-13-17)11-16-8-6-5-7-9-16/h5-10,12-13,19-20H,11,14H2,1-4H3
51 atoms
O  -1.784727 1.998249 0.321409
O  -2.494973 0.906545 -1.494918
O  1.833293 0.174728 -1.477249
C  -4.898712 0.08286 0.374055
C  -3.87816 -1.000261 0.33903
C  -3.442443 0.421781 0.650343
C  -5.555311 0.516197 -0.913495
C  -5.813804 0.188087 1.570414
C  -3.760395 -2.043086 1.390345
C  -2.561375 1.113213 -0.305131
C  -2.599029 -2.533619 1.831166
C  -2.546219 -3.582478 2.89873
C  -1.267203 -2.064688 1.32553
C  -0.707688 2.588229 -0.42143
C  0.406449 1.618115 -0.584676
C  1.245378 1.087543 0.449861
C  0.810524 1.017107 -1.726902
C  2.091084 0.216653 -0.148475
C  3.201795 -0.632229 0.355761
C  4.519658 -0.276093 -0.288478
C  4.974405 -0.97244 -1.403778
C  5.280276 0.784225 0.197632
C  6.167157 -0.618942 -2.021178
C  6.473148 1.138959 -0.415996
C  6.919039 0.439097 -1.530003
H  -3.605882 -1.322814 -0.663885
H  -3.214566 0.624199 1.69069
H  -5.826092 1.573596 -0.879277
H  -4.928167 0.358598 -1.78809
H  -6.475456 -0.051953 -1.066211
H  -6.680664 -0.465575 1.450577
H  -5.319294 -0.083943 2.503317
H  -6.185844 1.208582 1.680702
H  -4.68463 -2.431458 1.809728
H  -1.934993 -3.2502 3.742421
H  -2.08321 -4.500264 2.526594
H  -3.535944 -3.83472 3.279659
H  -1.325474 -1.538324 0.375348
H  -0.584468 -2.90619 1.195453
H  -0.794526 -1.393318 2.046526
H  -0.397946 3.441984 0.180343
H  -1.053439 2.966688 -1.384469
H  1.221374 1.333876 1.500219
H  0.478114 1.090968 -2.750802
H  2.975714 -1.687974 0.178702
H  3.257414 -0.500095 1.437411
H  4.394243 -1.801942 -1.790965
H  4.937285 1.335923 1.06553
H  6.508382 -1.170609 -2.888022
H  7.056032 1.962567 -0.023277
H  7.848983 0.715842 -2.01016
elementType: O C H
totalener: -1079.75283941 hartree
nucrepener: 2104.25004885 hartree
electener: -3184.00288826 hartree
oneelecener: -5647.82148517 hartree
twoeener: 2463.81859691 hartree
cpcmener: -0.02495958 hartree
kineticenergy: 1074.87335023 hartree
xcener: -106.462472842421 hartree
chargesum: -0.0000000
charge: -0.286497 -0.473988 -0.278340 0.150629 -0.011367 -0.078001 -0.281009 -0.284388 -0.310252 0.360279 0.008520 -0.229280 -0.257653 0.090819 -0.059147 -0.381168 -0.019794 0.214759 -0.044580 0.062173 -0.193279 -0.206532 -0.159699 -0.153905 -0.170787 0.101792 0.089045 0.098089 0.092453 0.093094 0.098233 0.092160 0.097142 0.120671 0.094455 0.096424 0.088761 0.084737 0.102781 0.103800 0.120389 0.114769 0.156151 0.172281 0.111305 0.111615 0.139827 0.141158 0.156405 0.157032 0.157913
qa: -0.2865 -0.4740 -0.2783 0.1506 -0.0114 -0.0780 -0.2810 -0.2844 -0.3103 0.3603 0.0085 -0.2293 -0.2577 0.0908 -0.0591 -0.3812 -0.0198 0.2148 -0.0446 0.0622 -0.1933 -0.2065 -0.1597 -0.1539 -0.1708 0.1018 0.0890 0.0981 0.0925 0.0931 0.0982 0.0922 0.0971 0.1207 0.0945 0.0964 0.0888 0.0847 0.1028 0.1038 0.1204 0.1148 0.1562 0.1723 0.1113 0.1116 0.1398 0.1412 0.1564 0.1570 0.1579
va: 2.1062 2.0255 2.2783 3.7046 3.8097 3.7874 3.8894 3.9067 3.9051 4.1861 3.6995 3.9338 3.9470 3.8399 3.6022 3.9836 3.9613 3.6093 3.8048 3.5732 3.9531 3.9492 3.9021 3.8981 3.9002 1.0268 1.0334 0.9993 1.0202 1.0011 0.9999 1.0019 1.0031 1.0045 0.9956 0.9960 1.0065 1.0052 1.0007 0.9966 0.9907 1.0107 1.0119 0.9993 1.0037 1.0079 1.0066 1.0039 0.9912 0.9909 0.9903
dispcorr: -0.024151686 hartree
energy: -1079.776991099779
dipole: -18.86439 19.05565 0.19126 -10.27012 10.27778 0.00766 11.49624 -10.18004 1.31620
magnitude: 1.33004 au
magnitude: 3.38070 debye
