program: Gaussian 09
title: 000072852
version: EM64L-G09RevD.01
frameworkgroup: C1[X(C8H10O3)]
method: RPBEPBE
basis: SDD
operation: Freq
keyword: #pfreq=noraman
keyword: PBEPBE/SDD
title: #p freq=noraman PBEPBE/SDD
converged: NO YES NO NO
title: Mulliken charges:
elementType: O O O C C C C C C C C H H H H H H H H H H
charge: -0.165512 -0.165670 -0.169942 0.098793 0.172452 0.172959 -0.634539 -0.634785 -0.702688 -0.717747 0.216094 0.258636 0.298343 0.298381 0.258705 0.238831 0.230921 0.230861 0.250157 0.215647 0.250104
chargesum: 0.00000
title: Mulliken charges with hydrogens summed into heavy atoms:
elementType: O O O C C C C C C C C
charge: -0.165512 -0.165670 -0.169942 0.098793 0.172452 0.172959 -0.077560 -0.077699 -0.002076 -0.001839 0.216094
polarizability: 1.06344446e+02 -6.82168977e-03 9.40677462e+01 1.08150222e+00 1.46281040e-03 7.38946362e+01
1716.lowfreq: -18.6898 -0.0008 -0.0006 0.0004 4.4519 6.4873 45.5100 75.4101 93.4047
frequency: 45.4890 75.3995 93.3995 160.0659 188.1168 228.3263 236.8235 305.0509 309.7024 394.0193 398.2659 409.4757 416.5211 463.4309 564.1053 569.0236 601.0400 609.9310 734.2396 796.2087 829.1206 847.6373 900.9347 950.3678 959.8180 990.3531 1033.5963 1089.8832 1101.3829 1131.4871 1159.6844 1163.3814 1220.7407 1253.2480 1257.6067 1266.3510 1374.0696 1404.6090 1412.9520 1421.1565 1455.9381 1461.3981 1476.1712 1481.2554 1609.7355 1629.3948 1662.7514 2974.5492 2978.0427 2985.2934 3011.2959 3084.4269 3094.0307 3105.6721 3107.2751 3111.8202 3117.5885
redmass: 5.8843 4.0745 7.5264 1.0607 1.4804 4.1457 1.4885 3.2597 3.0852 2.3031 3.6571 5.9890 4.1779 3.0723 6.2705 3.4741 4.0455 4.1190 4.1301 2.3680 1.7762 3.5392 2.5891 1.3710 2.9025 1.5201 2.5991 1.3424 2.9385 2.0075 2.4342 1.6780 5.9286 1.3539 4.2635 1.5145 1.1748 1.1928 1.0794 1.0816 1.0489 1.0480 1.0534 1.0564 10.4078 8.4789 11.9256 1.0660 1.0651 1.0347 1.0358 1.1001 1.1015 1.0935 1.0950 1.0998 1.1012
irintensity: 0.2343 1.0155 10.9140 0.1390 0.0222 0.0181 0.9115 12.1724 3.1199 2.4670 11.2548 15.2582 5.1818 4.2966 0.8055 5.7572 23.5042 3.2384 2.6549 8.7681 0.0297 2.0205 4.5854 3.4950 1.7978 2.0300 1.2141 2.2679 51.1465 55.8056 24.0582 62.3904 146.5136 2.4848 81.5460 0.3658 7.3745 36.0778 29.6367 24.5950 10.4846 0.4755 21.0104 15.8319 244.4218 236.4836 109.1532 0.4292 0.3482 21.1118 11.7414 29.9175 7.0112 1.6264 0.5336 18.2633 11.2653
temp: 298.150 k
press: 1.00000 atm
elementType: 8 8 8 6 6 6 6 6 6 6 6 1 1 1 1 1 1 1 1 1 1
symmnumber: 1
zpe: 428942.9 jmol-1
zpe.correction: 0.163376 hartree
zpe.thermalcorrener: 0.174533 hartree
zpe.thermalcorrenthalpy: 0.175477 hartree
zpe.thermalcorrgfe: 0.126419 hartree
zpe.sumelectzpe: -535.676472 hartree
zpe.sumelectthermal: -535.665315 hartree
zpe.sumelectthermalent: -535.664371 hartree
zpe.sumelectthermalfe: -535.713429 hartree
dipole: -1.1932 -0.0006 4.3731
dipole: 4.5330
quadrupole: -73.5711 -74.8199 -62.5638
quadrupole: -0.0037 0.9235 0.0029
quadrupole: -3.2529 -4.5016 7.7545 -0.0037 0.9235 0.0029
hfenergy: -535.839848 hartree
pointgroup: C01 [X(C8H10O3)]
dipole: 0.4770783 0.000531 -1.7184275 debye
dipolederiv: -0.572295 -0.1231965 -0.1029766 -0.1309545 -0.8212645 -0.2274614 -0.2216472 -0.3460858 -0.3764211 -0.5722787 0.1234047 -0.1030937 0.1311642 -0.8222587 0.2277405 -0.2203139 0.3442448 -0.37594 -1.0720314 -0.0000266 0.1345931 -0.0001953 -0.4908736 -0.0001078 0.395469 -0.000055 -0.3137041 -0.2143973 -0.0005926 0.0853979 0.0000947 -0.5427464 -0.0003797 0.0581525 0.0008157 -0.1071627 1.0140687 -0.082797 0.207262 -0.1317518 0.9663227 0.412155 0.3548017 0.4888085 0.29374 1.0143819 0.0830065 0.2070812 0.1316046 0.9669155 -0.4121197 0.3539352 -0.4880905 0.2937907 -0.6267839 -0.2168879 -0.0781414 -0.2126828 -0.3607097 0.0495331 -0.0646877 0.0244796 -0.0085587 -0.6263192 0.2170329 -0.0780088 0.2121969 -0.360468 -0.0498513 -0.0660192 -0.0243561 -0.0088524 -0.0208185 0.0001037 -0.0408736 0.000091 0.0312008 -0.0000197 -0.0041767 -0.0000682 0.0035487 0.0650963 -0.0001016 -0.0075706 -0.0002572 0.0140107 0.00022 -0.0826527 -0.0000887 0.107833 1.2011868 0.0002026 -0.347962 0.0007061 1.0732412 0.0003263 -0.6013679 0.0001105 0.2074424 0.1482767 -0.0131971 0.0322653 -0.0218328 0.1375808 -0.0322968 0.0153401 -0.0031284 -0.0278652 0.0134345 0.0323757 0.0117854 0.0299129 -0.0030729 -0.0285851 0.0290267 -0.0550726 0.0986382 0.0134566 -0.0324192 0.0118435 -0.0299819 -0.0031769 0.0285213 0.0290446 0.0548896 0.0987267 0.1482026 0.0131888 0.0323764 0.0218575 0.1374895 0.0324794 0.0155095 0.0033396 -0.0276432 0.0639143 0.0000355 0.0558611 -0.0000317 0.0948192 -0.0000682 0.0164015 -0.0000234 -0.1004863 0.0250596 0.0614799 0.0103418 0.1258567 -0.027275 -0.0380473 0.0205731 -0.0543602 0.074673 0.0249169 -0.0615601 0.010384 -0.1258818 -0.0271595 0.0381147 0.0206644 0.0544511 0.074552 0.0325339 0.0804698 0.0479999 0.1067725 -0.0254418 -0.050752 0.0271508 -0.0138734 0.0563059 -0.0919923 0.0000299 -0.1365968 0.0000184 0.0880313 -0.0000247 -0.1024736 0.0000238 -0.0189003 0.0323873 -0.0805516 0.0480321 -0.1067058 -0.0251647 0.0506235 0.0272696 0.0140392 0.0562835 unknown
polarizability: 106.3342197|-0.0006369|94.0677376|1.2253583|0.010081|73.9048711 unknown
InChI: InChI=1S/C8H10O3/c1-8(2)6(10)3-5(9)4-7(8)11/h3-4H2,1-2H3
charge 0 multiplicity 1
21 atoms
O  0.761352 2.253907 0.79168
O  0.760847 -2.255426 0.788847
O  -3.072472 0.000683 0.436443
C  1.133914 -0.000201 -0.109594
C  0.290601 1.271574 0.170106
C  0.289506 -1.270973 0.171072
C  -1.154956 1.29282 -0.350401
C  -1.15541 -1.291605 -0.350991
C  2.427811 -0.000463 0.726806
C  1.494463 -0.00081 -1.641005
C  -1.915277 0.000644 -0.04603
H  -1.117575 1.408698 -1.454423
H  -1.688343 2.160701 0.067111
H  -1.689398 -2.15967 0.065377
H  -1.117213 -1.406483 -1.455104
H  2.20324 -0.000122 1.806233
H  3.022321 -0.902013 0.505103
H  3.022922 0.90057 0.504619
H  2.098146 -0.895729 -1.872104
H  0.607847 -0.000672 -2.299956
H  2.098873 0.893471 -1.872691
