program: Orca
programVersion: 5.0.2
elementType: O O O C C C C C C C C C C C C C C C C C C C C C C H H H H H H H H H H H H H H H H H H H H H H H H H H
charge: 0
multiplicity: 1
keywords: wb97x-d3
keywords: def2-TZVPP
keywords: def2/J RIJCOSX
keywords: DEFGRID2
keywords: scfconv7
keywords: smallprint printgap noloewdin
keywords: NOSOSCF
formula: C22H26O3
InChI: InChI=1/C22H26O3/c1-15(2)10-19-20(22(19,3)4)21(23)25-14-17-12-18(24-13-17)11-16-8-6-5-7-9-16/h5-10,12-13,19-20H,11,14H2,1-4H3
51 atoms
O  -1.463768 1.747795 1.058769
O  -2.36043 2.141754 -0.949732
O  1.885323 2.902803 -1.460736
C  -1.64214 -1.185882 -0.073729
C  -2.490099 -0.956918 1.144535
C  -2.6085 -0.011074 -0.02104
C  -0.151856 -0.968616 0.034014
C  -2.012171 -2.295709 -1.025826
C  -3.639925 -1.834747 1.481162
C  -2.142922 1.390751 -0.026513
C  -3.593142 -2.857565 2.338739
C  -4.809082 -3.680886 2.63677
C  -2.348846 -3.273822 3.061187
C  -0.784337 3.016973 1.037047
C  0.466834 2.908923 0.242708
C  1.685219 2.276832 0.650401
C  0.654453 3.267105 -1.04954
C  2.508239 2.293918 -0.42361
C  3.839017 1.678439 -0.678781
C  3.677225 0.232016 -1.086617
C  3.312587 -0.105647 -2.387695
C  3.820882 -0.783831 -0.146234
C  3.091698 -1.430444 -2.738245
C  3.604671 -2.110304 -0.495327
C  3.23484 -2.437466 -1.792368
H  -1.939159 -0.572328 1.997518
H  -3.484403 -0.138946 -0.64927
H  0.122753 -0.259747 0.812114
H  0.336663 -1.91507 0.275639
H  0.268674 -0.614635 -0.910097
H  -1.608929 -3.249655 -0.67837
H  -3.090114 -2.414088 -1.134742
H  -1.597991 -2.104712 -2.017973
H  -4.584603 -1.61694 0.990412
H  -5.047098 -3.660495 3.703782
H  -4.646567 -4.730676 2.377982
H  -5.686394 -3.332681 2.091274
H  -1.476802 -2.676407 2.79944
H  -2.110459 -4.318305 2.84286
H  -2.485799 -3.211355 4.144147
H  -0.570428 3.23091 2.082986
H  -1.440638 3.801752 0.660236
H  1.905336 1.847369 1.615844
H  0.030837 3.774336 -1.769017
H  4.437408 1.742683 0.231007
H  4.370313 2.239285 -1.451055
H  3.1974 0.672066 -3.133958
H  4.104472 -0.535551 0.870099
H  2.805621 -1.677006 -3.753011
H  3.724288 -2.888066 0.248434
H  3.061922 -3.470514 -2.065773
elementType: O C H
totalener: -1079.75044037 hartree
nucrepener: 2183.68056658 hartree
electener: -3263.43100696 hartree
oneelecener: -5806.55521443 hartree
twoeener: 2543.12420747 hartree
cpcmener: -0.02563936 hartree
kineticenergy: 1074.86214236 hartree
xcener: -106.461036554711 hartree
chargesum: 0.0000000
charge: -0.275127 -0.468355 -0.273580 0.192329 0.012775 -0.141869 -0.351832 -0.275714 -0.277449 0.402230 -0.032247 -0.230665 -0.250596 0.070683 -0.047712 -0.402153 -0.019487 0.249451 -0.052626 0.026875 -0.189763 -0.169422 -0.156536 -0.173680 -0.162013 0.104272 0.093320 0.100030 0.101750 0.103290 0.094349 0.091947 0.099940 0.119444 0.094094 0.093626 0.089198 0.086136 0.095590 0.099983 0.117182 0.118263 0.161239 0.171439 0.106865 0.111360 0.138423 0.136441 0.155928 0.155592 0.156783
qa: -0.2751 -0.4684 -0.2736 0.1923 0.0128 -0.1419 -0.3518 -0.2757 -0.2774 0.4022 -0.0322 -0.2307 -0.2506 0.0707 -0.0477 -0.4022 -0.0195 0.2495 -0.0526 0.0269 -0.1898 -0.1694 -0.1565 -0.1737 -0.1620 0.1043 0.0933 0.1000 0.1018 0.1033 0.0943 0.0919 0.0999 0.1194 0.0941 0.0936 0.0892 0.0861 0.0956 0.1000 0.1172 0.1183 0.1612 0.1714 0.1069 0.1114 0.1384 0.1364 0.1559 0.1556 0.1568
va: 2.1140 2.0317 2.2791 3.6528 3.7651 3.8974 3.9124 3.9011 3.8526 4.2103 3.7085 3.9293 3.9410 3.8416 3.6210 3.9682 3.9674 3.5565 3.8159 3.6189 3.9326 3.8867 3.9017 3.8769 3.8715 1.0178 1.0335 1.0085 1.0003 0.9955 1.0022 1.0032 1.0025 1.0084 0.9954 0.9962 1.0076 1.0086 0.9978 0.9984 0.9951 1.0102 1.0086 1.0036 1.0106 1.0141 1.0110 1.0046 0.9912 0.9921 0.9907
dispcorr: -0.026983400 hartree
energy: -1079.777423771358
dipole: -10.84268 11.62558 0.78291 -24.35827 23.37363 -0.98465 9.76102 -8.56694 1.19408
magnitude: 1.73445 au
magnitude: 4.40861 debye
