program: Orca
programVersion: 5.0.2
elementType: O O O C C C C C C C C C C C C C C C C C C C C C C H H H H H H H H H H H H H H H H H H H H H H H H H H
charge: 0
multiplicity: 1
keywords: wb97x-d3
keywords: def2-TZVPP
keywords: def2/J RIJCOSX
keywords: DEFGRID2
keywords: scfconv7
keywords: smallprint printgap noloewdin
keywords: NOSOSCF
formula: C22H26O3
InChI: InChI=1/C22H26O3/c1-15(2)10-19-20(22(19,3)4)21(23)25-14-17-12-18(24-13-17)11-16-8-6-5-7-9-16/h5-10,12-13,19-20H,11,14H2,1-4H3
51 atoms
O  -1.384952 1.603338 1.084906
O  -2.277821 2.037162 -0.916696
O  1.933507 2.904229 -1.408812
C  -1.548953 -1.316147 -0.085336
C  -2.424464 -1.103407 1.118636
C  -2.509789 -0.139326 -0.042721
C  -0.061032 -1.100233 0.063781
C  -1.884949 -2.407651 -1.072508
C  -3.596267 -1.957329 1.40815
C  -2.053778 1.265055 -0.012737
C  -3.85355 -2.598644 2.552671
C  -5.102697 -3.412596 2.71225
C  -2.966891 -2.575607 3.760394
C  -0.728575 2.884772 1.098907
C  0.52044 2.821594 0.296832
C  1.742951 2.176375 0.670444
C  0.701437 3.240602 -0.977786
C  2.561724 2.247928 -0.404374
C  3.891869 1.648368 -0.694417
C  3.72874 0.236164 -1.208386
C  3.297318 -0.000568 -2.511862
C  3.942998 -0.850388 -0.366183
C  3.080655 -1.296072 -2.959533
C  3.732013 -2.148381 -0.813475
C  3.296106 -2.374804 -2.111316
H  -1.892417 -0.730608 1.986731
H  -3.372519 -0.257926 -0.690304
H  0.194317 -0.412866 0.867327
H  0.425685 -2.051745 0.288188
H  0.377661 -0.718666 -0.861213
H  -1.505676 -3.370669 -0.72386
H  -2.955994 -2.515171 -1.240323
H  -1.420818 -2.202374 -2.039372
H  -4.318654 -2.057923 0.602667
H  -4.866016 -4.460478 2.916431
H  -5.735609 -3.37802 1.825343
H  -5.69538 -3.060705 3.561248
H  -3.476219 -2.10771 4.607334
H  -2.027075 -2.048854 3.605954
H  -2.724226 -3.594059 4.074436
H  -0.514894 3.071463 2.150057
H  -1.400173 3.668312 0.747175
H  1.968625 1.703256 1.613907
H  0.072777 3.777341 -1.67101
H  4.48335 1.643431 0.222014
H  4.431533 2.262042 -1.419575
H  3.128624 0.832678 -3.184164
H  4.279728 -0.681144 0.650121
H  2.74395 -1.464053 -3.97482
H  3.907442 -2.982285 -0.145547
H  3.127201 -3.385171 -2.461253
elementType: O C H
totalener: -1079.75135042 hartree
nucrepener: 2173.61151380 hartree
electener: -3253.36286422 hartree
oneelecener: -5786.42390907 hartree
twoeener: 2533.06104485 hartree
cpcmener: -0.02614686 hartree
kineticenergy: 1074.85702754 hartree
xcener: -106.460792164221 hartree
chargesum: -0.0000000
charge: -0.276796 -0.468216 -0.274177 0.152452 0.066308 -0.129331 -0.316731 -0.274002 -0.296667 0.401994 -0.040886 -0.222404 -0.254364 0.068727 -0.043564 -0.405793 -0.019613 0.252595 -0.052125 0.023406 -0.185573 -0.175719 -0.159368 -0.166397 -0.164346 0.096295 0.089568 0.097069 0.100807 0.094861 0.095299 0.088670 0.097828 0.116556 0.093343 0.087826 0.092474 0.097271 0.088724 0.093710 0.117637 0.118271 0.161267 0.171186 0.104248 0.112882 0.138361 0.136880 0.156478 0.155828 0.157248
qa: -0.2768 -0.4682 -0.2742 0.1525 0.0663 -0.1293 -0.3167 -0.2740 -0.2967 0.4020 -0.0409 -0.2224 -0.2544 0.0687 -0.0436 -0.4058 -0.0196 0.2526 -0.0521 0.0234 -0.1856 -0.1757 -0.1594 -0.1664 -0.1643 0.0963 0.0896 0.0971 0.1008 0.0949 0.0953 0.0887 0.0978 0.1166 0.0933 0.0878 0.0925 0.0973 0.0887 0.0937 0.1176 0.1183 0.1613 0.1712 0.1042 0.1129 0.1384 0.1369 0.1565 0.1558 0.1572
va: 2.1138 2.0313 2.2786 3.6733 3.7302 3.8605 3.9187 3.9062 3.8676 4.1965 3.7535 3.9244 3.9435 3.8456 3.6170 3.9698 3.9692 3.5524 3.8142 3.6260 3.9289 3.8943 3.9044 3.8792 3.8760 1.0258 1.0358 1.0095 1.0004 0.9968 1.0026 1.0059 1.0018 1.0107 0.9963 1.0089 0.9957 0.9963 1.0098 0.9977 0.9948 1.0101 1.0086 1.0034 1.0117 1.0129 1.0128 1.0047 0.9913 0.9918 0.9905
dispcorr: -0.026165758 hartree
energy: -1079.777516175716
dipole: -12.33994 13.05778 0.71784 -22.82194 21.93040 -0.89154 10.83475 -9.62046 1.21428
magnitude: 1.66872 au
magnitude: 4.24155 debye
