program: Orca
programVersion: 5.0.2
elementType: O O O C C C C C C C C C C C C C C C C C C C C C C H H H H H H H H H H H H H H H H H H H H H H H H H H
charge: 0
multiplicity: 1
keywords: wb97x-d3
keywords: def2-TZVPP
keywords: def2/J RIJCOSX
keywords: DEFGRID2
keywords: scfconv7
keywords: smallprint printgap noloewdin
keywords: NOSOSCF
formula: C22H26O3
InChI: InChI=1/C22H26O3/c1-15(2)10-19-20(22(19,3)4)21(23)25-14-17-12-18(24-13-17)11-16-8-6-5-7-9-16/h5-10,12-13,19-20H,11,14H2,1-4H3
51 atoms
O  -1.589227 1.751787 -0.529141
O  -1.458427 1.305478 1.65627
O  2.644708 2.398951 0.50761
C  -1.907896 -1.62999 0.586741
C  -3.150588 -1.100183 1.239786
C  -2.463908 -0.277085 0.169534
C  -0.645947 -1.72291 1.408983
C  -2.023718 -2.733906 -0.436754
C  -4.489927 -1.66255 0.972345
C  -1.790876 0.983022 0.539581
C  -5.370415 -2.088254 1.88441
C  -6.70268 -2.634044 1.465466
C  -5.139895 -2.084062 3.365268
C  -0.868019 2.980354 -0.338512
C  0.596641 2.737111 -0.269335
C  1.480882 2.495954 -1.369328
C  1.365648 2.659444 0.842049
C  2.711414 2.297603 -0.841531
C  4.027966 1.955511 -1.444383
C  4.255385 0.46282 -1.513822
C  4.532767 -0.272245 -0.363339
C  4.167737 -0.206305 -2.730105
C  4.716237 -1.6459 -0.429854
C  4.35324 -1.581005 -2.799815
C  4.627191 -2.305594 -1.649164
H  -2.990041 -0.728761 2.246585
H  -2.934573 -0.264802 -0.80802
H  -0.567205 -2.72088 1.843859
H  0.23985 -1.56648 0.790402
H  -0.61243 -1.010355 2.229798
H  -2.885462 -2.617867 -1.092761
H  -1.133583 -2.763722 -1.068381
H  -2.110258 -3.704448 0.056711
H  -4.777468 -1.730752 -0.073337
H  -7.520241 -2.050572 1.896572
H  -6.837013 -3.65935 1.819984
H  -6.827339 -2.63502 0.382983
H  -5.170116 -3.104173 3.757874
H  -5.933646 -1.534805 3.879011
H  -4.18844 -1.647683 3.664449
H  -1.229152 3.504704 0.546276
H  -1.118853 3.583095 -1.209785
H  1.226245 2.476353 -2.417805
H  1.152623 2.778456 1.892706
H  4.828987 2.432939 -0.87343
H  4.064407 2.378255 -2.44954
H  4.610915 0.231007 0.593097
H  3.956633 0.353037 -3.634006
H  4.930735 -2.202939 0.473299
H  4.287807 -2.084321 -3.756166
H  4.772557 -3.377044 -1.700917
elementType: O C H
totalener: -1079.75452726 hartree
nucrepener: 2089.95163722 hartree
electener: -3169.70616448 hartree
oneelecener: -5619.37953428 hartree
twoeener: 2449.67336980 hartree
cpcmener: -0.02489349 hartree
kineticenergy: 1074.86305725 hartree
xcener: -106.460700923810 hartree
chargesum: -0.0000000
charge: -0.284672 -0.474278 -0.276024 0.111381 0.037847 -0.107161 -0.278199 -0.266734 -0.276490 0.399199 -0.048087 -0.219268 -0.249876 0.088071 -0.084437 -0.329487 -0.015492 0.218476 -0.066306 0.039248 -0.201335 -0.186897 -0.155165 -0.149426 -0.173505 0.091268 0.088186 0.095791 0.097697 0.091535 0.086623 0.097942 0.096779 0.117008 0.093323 0.092339 0.087499 0.095980 0.093943 0.089324 0.118546 0.119278 0.160716 0.169356 0.115742 0.103230 0.137565 0.138834 0.156642 0.155960 0.157511
qa: -0.2847 -0.4743 -0.2760 0.1114 0.0378 -0.1072 -0.2782 -0.2667 -0.2765 0.3992 -0.0481 -0.2193 -0.2499 0.0881 -0.0844 -0.3295 -0.0155 0.2185 -0.0663 0.0392 -0.2013 -0.1869 -0.1552 -0.1494 -0.1735 0.0913 0.0882 0.0958 0.0977 0.0915 0.0866 0.0979 0.0968 0.1170 0.0933 0.0923 0.0875 0.0960 0.0939 0.0893 0.1185 0.1193 0.1607 0.1694 0.1157 0.1032 0.1376 0.1388 0.1566 0.1560 0.1575
va: 2.1244 2.0314 2.2791 3.6904 3.7622 3.8629 3.9053 3.9067 3.8675 4.1810 3.7621 3.9222 3.9426 3.8239 3.6323 3.9987 3.9459 3.5995 3.8129 3.6217 3.9538 3.9367 3.9049 3.8925 3.9028 1.0345 1.0367 1.0008 0.9997 1.0192 1.0061 1.0021 1.0021 1.0103 0.9963 0.9963 1.0090 0.9972 0.9972 1.0101 1.0109 0.9934 1.0075 1.0046 1.0095 1.0107 1.0146 1.0041 0.9913 0.9912 0.9906
dispcorr: -0.022376398 hartree
energy: -1079.776903657385
dipole: -21.21963 21.06689 -0.15274 -20.31302 19.98546 -0.32756 5.66892 -6.63821 -0.96930
magnitude: 1.03449 au
magnitude: 2.62946 debye
