program: Orca
programVersion: 5.0.2
elementType: O O O C C C C C C C C C C C C C C C C C C C C C C H H H H H H H H H H H H H H H H H H H H H H H H H H
charge: 0
multiplicity: 1
keywords: wb97x-d3
keywords: def2-TZVPP
keywords: def2/J RIJCOSX
keywords: DEFGRID2
keywords: scfconv7
keywords: smallprint printgap noloewdin
keywords: NOSOSCF
formula: C22H26O3
InChI: InChI=1/C22H26O3/c1-15(2)10-19-20(22(19,3)4)21(23)25-14-17-12-18(24-13-17)11-16-8-6-5-7-9-16/h5-10,12-13,19-20H,11,14H2,1-4H3
51 atoms
O  -1.5118 1.570457 -0.148491
O  -2.152289 -0.274487 -1.235532
O  2.26656 -0.469232 -1.30196
C  -4.672753 0.135141 0.628489
C  -3.845689 -1.024021 1.100431
C  -3.177968 0.308553 0.847662
C  -5.247044 0.096102 -0.766157
C  -5.569559 0.843231 1.614342
C  -3.934772 -1.537235 2.485635
C  -2.247849 0.469178 -0.287407
C  -4.339967 -2.758291 2.847894
C  -4.397116 -3.15358 4.292843
C  -4.779929 -3.823608 1.890743
C  -0.54722 1.865924 -1.171365
C  0.697111 1.068961 -1.010109
C  1.754437 1.292734 -0.068764
C  1.068807 -0.018849 -1.724549
C  2.682284 0.333092 -0.293351
C  4.028157 0.065939 0.280007
C  5.129686 0.502523 -0.658234
C  5.520594 -0.305525 -1.723242
C  5.744644 1.74062 -0.497102
C  6.499136 0.118938 -2.611165
C  6.727031 2.165901 -1.381273
C  7.105132 1.357074 -2.443825
H  -3.653437 -1.76871 0.334842
H  -2.917374 0.890167 1.725779
H  -4.666927 -0.514352 -1.454957
H  -6.255277 -0.32221 -0.733303
H  -5.324955 1.100329 -1.188884
H  -5.118481 0.946299 2.60092
H  -5.813648 1.846454 1.258673
H  -6.508611 0.298639 1.736085
H  -3.65336 -0.843367 3.273011
H  -5.414749 -3.427847 4.584252
H  -4.063823 -2.353273 4.95382
H  -3.774943 -4.031417 4.487007
H  -5.813158 -4.117186 2.095445
H  -4.176395 -4.727091 2.011215
H  -4.726938 -3.524969 0.845409
H  -0.339739 2.928404 -1.049719
H  -0.98241 1.723154 -2.16132
H  1.815537 2.079539 0.66735
H  0.60298 -0.561138 -2.532575
H  4.131567 -0.997278 0.514003
H  4.107002 0.606466 1.223923
H  5.060896 -1.277314 -1.860081
H  5.454346 2.379411 0.329149
H  6.790134 -0.520412 -3.435103
H  7.198681 3.130056 -1.238401
H  7.869003 1.687998 -3.135853
elementType: O C H
totalener: -1079.75473451 hartree
nucrepener: 2024.21056576 hartree
electener: -3103.96530027 hartree
oneelecener: -5487.83275621 hartree
twoeener: 2383.86745595 hartree
cpcmener: -0.02537988 hartree
kineticenergy: 1074.85784645 hartree
xcener: -106.459500804384 hartree
chargesum: -0.0000000
charge: -0.284763 -0.476814 -0.278446 0.125827 0.024820 -0.126679 -0.284329 -0.261939 -0.273957 0.410736 -0.038599 -0.222814 -0.250463 0.087865 -0.079906 -0.336382 -0.014287 0.210833 -0.068919 0.061420 -0.199894 -0.200714 -0.154539 -0.146694 -0.175851 0.091192 0.087620 0.092244 0.094695 0.099231 0.087638 0.097202 0.095885 0.118033 0.092737 0.088032 0.093341 0.094800 0.095449 0.089240 0.121422 0.117851 0.159863 0.169740 0.117688 0.103816 0.138776 0.138787 0.155874 0.156371 0.156964
qa: -0.2848 -0.4768 -0.2784 0.1258 0.0248 -0.1267 -0.2843 -0.2619 -0.2740 0.4107 -0.0386 -0.2228 -0.2505 0.0879 -0.0799 -0.3364 -0.0143 0.2108 -0.0689 0.0614 -0.1999 -0.2007 -0.1545 -0.1467 -0.1759 0.0912 0.0876 0.0922 0.0947 0.0992 0.0876 0.0972 0.0959 0.1180 0.0927 0.0880 0.0933 0.0948 0.0954 0.0892 0.1214 0.1179 0.1599 0.1697 0.1177 0.1038 0.1388 0.1388 0.1559 0.1564 0.1570
va: 2.1228 2.0299 2.2806 3.6820 3.7635 3.8820 3.9050 3.9068 3.8718 4.1754 3.7366 3.9237 3.9437 3.8222 3.6149 4.0123 3.9515 3.6118 3.8281 3.5813 3.9578 3.9460 3.8990 3.8880 3.9046 1.0331 1.0385 1.0190 1.0008 0.9991 1.0048 1.0027 1.0031 1.0091 0.9963 1.0086 0.9961 0.9974 0.9974 1.0092 0.9924 1.0115 1.0077 1.0030 1.0060 1.0114 1.0121 1.0042 0.9912 0.9907 0.9906
dispcorr: -0.021695889 hartree
energy: -1079.776430395464
dipole: -28.15869 27.92542 -0.23328 -8.82820 9.43914 0.61094 13.87732 -12.99119 0.88613
magnitude: 1.10131 au
magnitude: 2.79932 debye
