program: Orca
programVersion: 5.0.2
elementType: O O O C C C C C C C C C C C C C C C C C C C C C C H H H H H H H H H H H H H H H H H H H H H H H H H H
charge: 0
multiplicity: 1
keywords: wb97x-d3
keywords: def2-TZVPP
keywords: def2/J RIJCOSX
keywords: DEFGRID2
keywords: scfconv7
keywords: smallprint printgap noloewdin
keywords: NOSOSCF
formula: C22H26O3
InChI: InChI=1/C22H26O3/c1-15(2)10-19-20(22(19,3)4)21(23)25-14-17-12-18(24-13-17)11-16-8-6-5-7-9-16/h5-10,12-13,19-20H,11,14H2,1-4H3
51 atoms
O  -1.568959 1.728726 0.024953
O  -2.17485 -0.016416 -1.233118
O  2.223696 -0.074451 -1.55583
C  -4.722786 0.145913 0.602636
C  -3.857737 -1.000242 1.035733
C  -3.244817 0.377866 0.872745
C  -5.257579 0.151419 -0.808752
C  -5.680619 0.774604 1.586648
C  -3.95715 -1.596881 2.381474
C  -2.29359 0.639211 -0.224839
C  -3.95267 -2.904546 2.658868
C  -4.111687 -3.392445 4.066946
C  -3.829925 -3.979017 1.61374
C  -0.618268 2.149934 -0.964851
C  0.621669 1.330914 -0.944578
C  1.620944 1.283981 0.082446
C  1.045742 0.479531 -1.906324
C  2.567704 0.414174 -0.341561
C  3.85473 -0.052772 0.237476
C  5.038176 0.357183 -0.605724
C  5.48591 -0.456524 -1.64257
C  5.678347 1.573111 -0.383446
C  6.550728 -0.063123 -2.441836
C  6.746116 1.967224 -1.17813
C  7.184688 1.15022 -2.211599
H  -3.612417 -1.691179 0.235627
H  -3.032718 0.918673 1.788695
H  -6.246172 -0.312038 -0.825117
H  -5.370464 1.172083 -1.181201
H  -4.632291 -0.395395 -1.510704
H  -5.967054 1.773203 1.250489
H  -6.593336 0.180241 1.666931
H  -5.26263 0.877375 2.587213
H  -4.057285 -0.902826 3.210724
H  -3.240062 -3.971447 4.384526
H  -4.97236 -4.061621 4.154443
H  -4.249898 -2.575437 4.77545
H  -4.79398 -4.18726 1.141559
H  -3.486813 -4.915931 2.054663
H  -3.131805 -3.720035 0.817194
H  -0.400402 3.184582 -0.701624
H  -1.071715 2.14818 -1.957467
H  1.63115 1.83397 1.010826
H  0.632242 0.183595 -2.858094
H  3.838943 -1.140866 0.35033
H  3.94131 0.366241 1.240803
H  5.003201 -1.409623 -1.824755
H  5.340377 2.21738 0.420301
H  6.887112 -0.707545 -3.244325
H  7.237471 2.913241 -0.988261
H  8.017345 1.456462 -2.831945
elementType: O C H
totalener: -1079.75441808 hartree
nucrepener: 2029.28371866 hartree
electener: -3109.03813674 hartree
oneelecener: -5498.04997000 hartree
twoeener: 2389.01183325 hartree
cpcmener: -0.02608443 hartree
kineticenergy: 1074.85581133 hartree
xcener: -106.459835904909 hartree
chargesum: 0.0000000
charge: -0.284807 -0.476177 -0.279030 0.100318 0.048237 -0.109066 -0.278974 -0.273299 -0.289988 0.411796 -0.024746 -0.217263 -0.281068 0.085600 -0.075668 -0.336453 -0.019956 0.198003 -0.060454 0.066586 -0.193868 -0.205267 -0.158749 -0.150521 -0.173002 0.090341 0.086986 0.095437 0.098111 0.092422 0.096345 0.097639 0.088319 0.114233 0.092909 0.096803 0.084602 0.107520 0.094259 0.099134 0.121643 0.117315 0.159390 0.171977 0.115193 0.108355 0.139183 0.140042 0.156135 0.156330 0.157198
qa: -0.2848 -0.4762 -0.2790 0.1003 0.0482 -0.1091 -0.2790 -0.2733 -0.2900 0.4118 -0.0247 -0.2173 -0.2811 0.0856 -0.0757 -0.3365 -0.0200 0.1980 -0.0605 0.0666 -0.1939 -0.2053 -0.1587 -0.1505 -0.1730 0.0903 0.0870 0.0954 0.0981 0.0924 0.0963 0.0976 0.0883 0.1142 0.0929 0.0968 0.0846 0.1075 0.0943 0.0991 0.1216 0.1173 0.1594 0.1720 0.1152 0.1084 0.1392 0.1400 0.1561 0.1563 0.1572
va: 2.1190 2.0321 2.2825 3.7005 3.7694 3.8376 3.9062 3.9139 3.8939 4.1717 3.7233 3.9218 3.9384 3.8399 3.6090 4.0100 3.9554 3.6403 3.8235 3.5652 3.9525 3.9472 3.9005 3.8914 3.9018 1.0289 1.0362 1.0001 0.9991 1.0204 1.0020 1.0013 1.0070 1.0115 0.9949 0.9934 1.0100 0.9935 1.0013 1.0023 0.9900 1.0091 1.0082 0.9989 1.0027 1.0093 1.0087 1.0038 0.9911 0.9908 0.9905
dispcorr: -0.021492488 hartree
energy: -1079.775910567911
dipole: -26.36631 26.13194 -0.23437 -10.62069 11.10367 0.48297 13.25866 -12.30977 0.94889
magnitude: 1.09022 au
magnitude: 2.77112 debye
