program: Orca
programVersion: 5.0.2
elementType: O O O C C C C C C C C C C C C C C C C C C C C C C H H H H H H H H H H H H H H H H H H H H H H H H H H
charge: 0
multiplicity: 1
keywords: wb97x-d3
keywords: def2-TZVPP
keywords: def2/J RIJCOSX
keywords: DEFGRID2
keywords: scfconv7
keywords: smallprint printgap noloewdin
keywords: NOSOSCF
formula: C22H26O3
InChI: InChI=1/C22H26O3/c1-15(2)10-19-20(22(19,3)4)21(23)25-14-17-12-18(24-13-17)11-16-8-6-5-7-9-16/h5-10,12-13,19-20H,11,14H2,1-4H3
51 atoms
O  -1.920326 2.176625 0.729787
O  -2.115575 1.574993 -1.414802
O  2.400733 2.237626 0.87304
C  -4.039237 -0.653763 -0.28048
C  -2.659263 -1.187426 -0.440504
C  -2.87288 0.111856 0.321705
C  -4.769703 -0.116555 -1.486281
C  -4.956384 -1.300428 0.72995
C  -2.13677 -2.374121 0.282136
C  -2.292711 1.342269 -0.240532
C  -0.902295 -2.428856 0.790343
C  -0.390225 -3.64207 1.501327
C  0.045736 -1.264971 0.698101
C  -1.06678 3.283753 0.392746
C  0.345303 2.827685 0.279549
C  1.017391 2.261395 -0.853826
C  1.241547 2.780402 1.293448
C  2.259097 1.920113 -0.436198
C  3.402257 1.242801 -1.10373
C  3.484044 -0.220911 -0.735698
C  2.983877 -1.192789 -1.597144
C  4.024789 -0.621622 0.484262
C  3.020809 -2.53678 -1.250014
C  4.059898 -1.96378 0.835591
C  3.557077 -2.926512 -0.030596
H  -2.236187 -1.032519 -1.431386
H  -2.795418 0.037703 1.400391
H  -4.103538 0.263926 -2.257549
H  -5.370007 -0.910737 -1.936132
H  -5.452114 0.688004 -1.203823
H  -4.422793 -1.654037 1.612747
H  -5.718433 -0.594752 1.066551
H  -5.472627 -2.156179 0.289324
H  -2.790035 -3.237411 0.375494
H  -0.069894 -3.394835 2.517455
H  0.489613 -4.048463 0.994415
H  -1.138426 -4.432449 1.565363
H  -0.19027 -0.501818 1.445856
H  0.011571 -0.77851 -0.277467
H  1.075303 -1.576062 0.879706
H  -1.179323 3.981832 1.221263
H  -1.411554 3.781668 -0.514038
H  0.625132 2.126869 -1.84899
H  1.196207 3.094878 2.32493
H  4.336887 1.748712 -0.846677
H  3.274048 1.345942 -2.181803
H  2.559681 -0.89666 -2.549644
H  4.427974 0.118989 1.165106
H  2.628021 -3.279736 -1.932751
H  4.48427 -2.258756 1.787103
H  3.585932 -3.97371 0.242604
elementType: O C H
totalener: -1079.75066060 hartree
nucrepener: 2223.49052539 hartree
electener: -3303.24118599 hartree
oneelecener: -5886.48707243 hartree
twoeener: 2583.24588644 hartree
cpcmener: -0.02291993 hartree
kineticenergy: 1074.85541653 hartree
xcener: -106.461022059055 hartree
chargesum: -0.0000000
charge: -0.287173 -0.477772 -0.277112 0.154536 0.008132 -0.084879 -0.281039 -0.283435 -0.345416 0.366470 0.047241 -0.227458 -0.266915 0.070305 -0.070826 -0.332787 -0.034926 0.224498 -0.055244 0.061792 -0.229714 -0.201722 -0.112862 -0.123101 -0.210486 0.100453 0.094404 0.091222 0.092701 0.097750 0.091441 0.097174 0.098121 0.120496 0.101834 0.089789 0.090162 0.109056 0.094505 0.073234 0.119169 0.116653 0.157048 0.172379 0.116707 0.103381 0.137516 0.137606 0.156038 0.155039 0.156015
qa: -0.2872 -0.4778 -0.2771 0.1545 0.0081 -0.0849 -0.2810 -0.2834 -0.3454 0.3665 0.0472 -0.2275 -0.2669 0.0703 -0.0708 -0.3328 -0.0349 0.2245 -0.0552 0.0618 -0.2297 -0.2017 -0.1129 -0.1231 -0.2105 0.1005 0.0944 0.0912 0.0927 0.0978 0.0914 0.0972 0.0981 0.1205 0.1018 0.0898 0.0902 0.1091 0.0945 0.0732 0.1192 0.1167 0.1570 0.1724 0.1167 0.1034 0.1375 0.1376 0.1560 0.1550 0.1560
va: 2.1060 2.0220 2.2726 3.7207 3.7836 3.8046 3.8880 3.9068 3.9135 4.1701 3.6658 3.9203 3.9589 3.8544 3.6487 3.9597 3.9577 3.5942 3.8089 3.5709 3.9180 3.9525 3.8082 3.8548 3.8866 1.0264 1.0334 1.0204 1.0010 0.9993 1.0025 1.0031 1.0000 1.0055 0.9946 0.9957 1.0079 1.0030 1.0014 1.0182 0.9961 1.0097 1.0202 0.9949 1.0066 1.0132 1.0057 1.0133 0.9901 0.9911 0.9925
dispcorr: -0.028643046 hartree
energy: -1079.779303649002
dipole: -12.86317 13.08864 0.22547 -16.23144 15.99346 -0.23798 2.17034 -1.39462 0.77572
magnitude: 0.84215 au
magnitude: 2.14058 debye
