program: Orca
programVersion: 5.0.2
elementType: O O O C C C C C C C C C C C C C C C C C C C C C C H H H H H H H H H H H H H H H H H H H H H H H H H H
charge: 0
multiplicity: 1
keywords: wb97x-d3
keywords: def2-TZVPP
keywords: def2/J RIJCOSX
keywords: DEFGRID2
keywords: scfconv7
keywords: smallprint printgap noloewdin
keywords: NOSOSCF
formula: C22H26O3
InChI: InChI=1/C22H26O3/c1-15(2)10-19-20(22(19,3)4)21(23)25-14-17-12-18(24-13-17)11-16-8-6-5-7-9-16/h5-10,12-13,19-20H,11,14H2,1-4H3
51 atoms
O  -1.235291 0.920711 -1.188694
O  -1.903357 1.649497 0.815299
O  2.362203 2.805534 0.680226
C  -2.296112 -1.441375 1.296808
C  -3.618639 -0.772973 1.064369
C  -2.491869 -0.551371 0.079789
C  -1.447875 -0.985746 2.458297
C  -2.164204 -2.918369 1.014945
C  -4.818092 -1.524616 0.631253
C  -1.86409 0.780196 -0.023347
C  -5.952138 -1.66299 1.325185
C  -7.099843 -2.45606 0.775621
C  -6.190049 -1.07481 2.682154
C  -0.546511 2.154822 -1.44058
C  0.75667 2.215169 -0.729123
C  1.918933 1.414639 -0.982794
C  1.089871 3.033365 0.29428
C  2.861564 1.81541 -0.097344
C  4.266179 1.399608 0.168231
C  4.700549 0.296003 -0.756485
C  5.424698 0.578837 -1.910148
C  4.361293 -1.027113 -0.485107
C  5.809745 -0.438735 -2.773283
C  4.74153 -2.046003 -1.346782
C  5.46855 -1.75451 -2.493778
H  -3.804151 0.07189 1.719943
H  -2.565179 -1.085158 -0.861935
H  -1.67079 -1.59856 3.334332
H  -0.384258 -1.103544 2.239477
H  -1.620075 0.051297 2.737911
H  -2.72514 -3.234292 0.136045
H  -1.1187 -3.187204 0.851991
H  -2.525989 -3.501986 1.864121
H  -4.756377 -2.010217 -0.3386
H  -6.885808 -2.862086 -0.213228
H  -8.001773 -1.842719 0.698412
H  -7.351998 -3.291394 1.434585
H  -5.352123 -0.492686 3.061078
H  -6.394466 -1.865703 3.408899
H  -7.071628 -0.428366 2.677159
H  -1.176323 3.008426 -1.184594
H  -0.398354 2.163244 -2.519972
H  2.024922 0.647438 -1.733723
H  0.5487 3.801188 0.825216
H  4.359298 1.074365 1.209329
H  4.930592 2.261843 0.057224
H  5.694026 1.604438 -2.134625
H  3.795651 -1.262205 0.409193
H  6.378301 -0.202203 -3.663783
H  4.472874 -3.070189 -1.120886
H  5.769546 -2.549503 -3.164047
elementType: O C H
totalener: -1079.75510422 hartree
nucrepener: 2064.56732112 hartree
electener: -3144.32242534 hartree
oneelecener: -5568.38739118 hartree
twoeener: 2424.06496584 hartree
cpcmener: -0.02481762 hartree
kineticenergy: 1074.85851100 hartree
xcener: -106.461363861214 hartree
chargesum: -0.0000000
charge: -0.284886 -0.473235 -0.280607 0.130129 0.020194 -0.127537 -0.285578 -0.261557 -0.274912 0.407451 -0.036664 -0.223427 -0.252046 0.091158 -0.100092 -0.300078 -0.022489 0.176803 -0.002701 0.000942 -0.183362 -0.197238 -0.156240 -0.153544 -0.165013 0.092304 0.087880 0.094990 0.098875 0.093208 0.087358 0.097731 0.096147 0.118477 0.088334 0.093327 0.092990 0.089506 0.095071 0.095381 0.117398 0.120207 0.159662 0.172549 0.108125 0.102918 0.138143 0.143045 0.156761 0.156085 0.158059
qa: -0.2849 -0.4732 -0.2806 0.1301 0.0202 -0.1275 -0.2856 -0.2616 -0.2749 0.4075 -0.0367 -0.2234 -0.2520 0.0912 -0.1001 -0.3001 -0.0225 0.1768 -0.0027 0.0009 -0.1834 -0.1972 -0.1562 -0.1535 -0.1650 0.0923 0.0879 0.0950 0.0989 0.0932 0.0874 0.0977 0.0961 0.1185 0.0883 0.0933 0.0930 0.0895 0.0951 0.0954 0.1174 0.1202 0.1597 0.1725 0.1081 0.1029 0.1381 0.1430 0.1568 0.1561 0.1581
va: 2.1211 2.0347 2.2751 3.6846 3.7661 3.8932 3.9025 3.9044 3.8712 4.1703 3.7344 3.9244 3.9442 3.8358 3.6744 3.9775 3.9616 3.6821 3.8187 3.6303 3.9346 3.9271 3.8996 3.8979 3.8949 1.0323 1.0387 1.0007 0.9996 1.0193 1.0047 1.0026 1.0030 1.0089 1.0087 0.9959 0.9963 1.0092 0.9972 0.9974 1.0083 0.9903 1.0047 0.9998 1.0047 1.0084 1.0046 1.0032 0.9910 0.9914 0.9902
dispcorr: -0.022263780 hartree
energy: -1079.777367998221
dipole: -23.99083 24.09667 0.10583 -18.18256 17.32264 -0.85992 9.15214 -9.67799 -0.52585
magnitude: 1.01350 au
magnitude: 2.57612 debye
