program: Orca
programVersion: 5.0.2
elementType: O O O C C C C C C C C C C C C C C C C C C C C C C H H H H H H H H H H H H H H H H H H H H H H H H H H
charge: 0
multiplicity: 1
keywords: wb97x-d3
keywords: def2-TZVPP
keywords: def2/J RIJCOSX
keywords: DEFGRID2
keywords: scfconv7
keywords: smallprint printgap noloewdin
keywords: NOSOSCF
formula: C22H26O3
InChI: InChI=1/C22H26O3/c1-15(2)10-19-20(22(19,3)4)21(23)25-14-17-12-18(24-13-17)11-16-8-6-5-7-9-16/h5-10,12-13,19-20H,11,14H2,1-4H3
51 atoms
O  -1.515363 0.972621 -0.638592
O  -1.36478 0.832814 1.586649
O  2.360591 -0.661991 -0.569919
C  -3.158887 -1.709255 1.092628
C  -3.991623 -0.582019 1.62485
C  -3.09524 -0.346076 0.423085
C  -2.003608 -2.204665 1.927868
C  -3.813063 -2.808619 0.291033
C  -5.455369 -0.513317 1.44843
C  -1.916183 0.529364 0.555968
C  -6.355942 -0.175231 2.377379
C  -7.817276 -0.127598 2.043407
C  -6.030129 0.190294 3.793903
C  -0.354407 1.800085 -0.680391
C  0.895631 1.002834 -0.535135
C  2.172698 1.493184 -0.117014
C  1.073426 -0.312522 -0.798113
C  3.023672 0.439824 -0.159113
C  4.483019 0.31133 0.095046
C  5.279812 0.3371 -1.188906
C  5.355711 -0.789534 -2.004728
C  5.922019 1.502788 -1.595246
C  6.05525 -0.748281 -3.20266
C  6.626074 1.545568 -2.791399
C  6.692633 0.42002 -3.600357
H  -3.609314 -0.151026 2.543829
H  -3.588016 -0.292719 -0.541585
H  -1.605669 -1.450922 2.603127
H  -2.331292 -3.047915 2.539465
H  -1.184969 -2.558014 1.296753
H  -3.070525 -3.330126 -0.316451
H  -4.27132 -3.545085 0.95481
H  -4.586832 -2.444868 -0.384162
H  -5.826662 -0.750711 0.455548
H  -8.383818 -0.832004 2.658619
H  -8.011016 -0.364565 0.997282
H  -8.235093 0.862295 2.246405
H  -4.994861 0.002505 4.072664
H  -6.662523 -0.368989 4.487698
H  -6.235481 1.24852 3.978168
H  -0.404095 2.586301 0.075819
H  -0.392959 2.287103 -1.655668
H  2.418522 2.502029 0.176538
H  0.410864 -1.099077 -1.124264
H  4.684344 -0.611279 0.646067
H  4.790231 1.137156 0.737714
H  4.868297 -1.708953 -1.702099
H  5.871719 2.386599 -0.969801
H  6.105195 -1.632027 -3.826194
H  7.12335 2.459805 -3.090119
H  7.240477 0.451068 -4.533508
elementType: O C H
totalener: -1079.75380630 hartree
nucrepener: 2031.24540923 hartree
electener: -3110.99921553 hartree
oneelecener: -5501.74839268 hartree
twoeener: 2390.74917714 hartree
cpcmener: -0.02698557 hartree
kineticenergy: 1074.85237961 hartree
xcener: -106.461103702200 hartree
chargesum: -0.0000000
charge: -0.291057 -0.465149 -0.281928 0.103239 0.042633 -0.085238 -0.274327 -0.269724 -0.281928 0.371857 -0.041581 -0.218895 -0.257102 0.114080 -0.035431 -0.345207 -0.062576 0.218761 -0.069482 0.054834 -0.203553 -0.195863 -0.153734 -0.147742 -0.175222 0.089350 0.089041 0.094293 0.097363 0.094005 0.096704 0.097406 0.087614 0.116205 0.093321 0.087329 0.092467 0.091506 0.092364 0.099619 0.113235 0.118269 0.160827 0.170588 0.117233 0.104308 0.139159 0.138420 0.155949 0.156654 0.157107
qa: -0.2911 -0.4651 -0.2819 0.1032 0.0426 -0.0852 -0.2743 -0.2697 -0.2819 0.3719 -0.0416 -0.2189 -0.2571 0.1141 -0.0354 -0.3452 -0.0626 0.2188 -0.0695 0.0548 -0.2036 -0.1959 -0.1537 -0.1477 -0.1752 0.0893 0.0890 0.0943 0.0974 0.0940 0.0967 0.0974 0.0876 0.1162 0.0933 0.0873 0.0925 0.0915 0.0924 0.0996 0.1132 0.1183 0.1608 0.1706 0.1172 0.1043 0.1392 0.1384 0.1559 0.1567 0.1571
va: 2.1216 2.0345 2.2724 3.6950 3.7841 3.8200 3.9002 3.9089 3.8849 4.1988 3.7531 3.9222 3.9420 3.8181 3.6259 4.0121 3.9502 3.6161 3.8211 3.5965 3.9583 3.9442 3.9011 3.8888 3.9048 1.0347 1.0360 1.0189 1.0009 1.0018 1.0020 1.0016 1.0062 1.0114 0.9965 1.0092 0.9955 1.0088 0.9981 0.9956 1.0123 0.9907 1.0056 0.9986 1.0079 1.0114 1.0131 1.0044 0.9913 0.9908 0.9906
dispcorr: -0.021995015 hartree
energy: -1079.775801315521
dipole: -28.37860 27.95612 -0.42248 -7.81053 7.80362 -0.00690 11.10298 -11.59450 -0.49153
magnitude: 0.64818 au
magnitude: 1.64754 debye
