program: Orca
programVersion: 5.0.2
elementType: O O O C C C C C C C C C C C C C C C C C C C C C C H H H H H H H H H H H H H H H H H H H H H H H H H H
charge: 0
multiplicity: 1
keywords: wb97x-d3
keywords: def2-TZVPP
keywords: def2/J RIJCOSX
keywords: DEFGRID2
keywords: scfconv7
keywords: smallprint printgap noloewdin
keywords: NOSOSCF
formula: C22H26O3
InChI: InChI=1/C22H26O3/c1-15(2)10-19-20(22(19,3)4)21(23)25-14-17-12-18(24-13-17)11-16-8-6-5-7-9-16/h5-10,12-13,19-20H,11,14H2,1-4H3
51 atoms
O  -1.359661 1.555522 0.891827
O  -2.637466 1.51382 -0.940329
O  1.3692 0.317141 -2.265603
C  -4.749109 0.200182 0.975574
C  -4.040982 -0.845661 0.188887
C  -3.227511 0.185706 0.958331
C  -5.516538 1.276152 0.247184
C  -5.373915 -0.1772 2.297532
C  -3.999804 -2.275816 0.586155
C  -2.415862 1.145332 0.191243
C  -3.021779 -3.124553 0.257871
C  -3.071228 -4.566518 0.660533
C  -1.807947 -2.722884 -0.523137
C  -0.386375 2.367896 0.213037
C  0.530655 1.532907 -0.612332
C  1.808615 1.018166 -0.216921
C  0.32373 1.069703 -1.869109
C  2.273924 0.289211 -1.259361
C  3.506719 -0.51533 -1.482854
C  4.640455 -0.065811 -0.6015
C  5.025741 -0.811041 0.50663
C  5.320369 1.117439 -0.883501
C  6.073893 -0.388888 1.315848
C  6.367196 1.540841 -0.079741
C  6.748362 0.786915 1.023884
H  -4.038299 -0.66924 -0.88398
H  -2.76627 -0.161522 1.875764
H  -5.515266 2.210276 0.812639
H  -5.126642 1.484015 -0.746407
H  -6.557397 0.966758 0.129715
H  -4.785811 -0.911392 2.848351
H  -5.480802 0.702867 2.934585
H  -6.37133 -0.595569 2.146336
H  -4.842663 -2.655708 1.156931
H  -3.044842 -5.220507 -0.215348
H  -3.969443 -4.80539 1.230273
H  -2.203658 -4.834358 1.269803
H  -1.724306 -3.314754 -1.438445
H  -0.898308 -2.918493 0.050903
H  -1.799447 -1.671476 -0.806899
H  0.166172 2.862634 1.010018
H  -0.878704 3.139502 -0.379502
H  2.309288 1.185842 0.724146
H  -0.47473 1.194694 -2.582662
H  3.799225 -0.436493 -2.53354
H  3.296718 -1.574538 -1.304464
H  4.506058 -1.733274 0.738276
H  5.029546 1.710893 -1.742732
H  6.364087 -0.983018 2.172922
H  6.889329 2.459154 -0.316358
H  7.567994 1.115402 1.649837
elementType: O C H
totalener: -1079.75233465 hartree
nucrepener: 2085.26344529 hartree
electener: -3165.01577994 hartree
oneelecener: -5609.65385903 hartree
twoeener: 2444.63807909 hartree
cpcmener: -0.02231951 hartree
kineticenergy: 1074.85931106 hartree
xcener: -106.460643669419 hartree
chargesum: -0.0000000
charge: -0.287055 -0.481571 -0.278845 0.156244 -0.031052 -0.086827 -0.277379 -0.290689 -0.286360 0.380581 -0.011422 -0.229686 -0.231770 0.089776 -0.092324 -0.306120 -0.016032 0.179040 -0.012450 -0.003029 -0.173599 -0.200841 -0.155380 -0.146793 -0.168190 0.100785 0.089376 0.098148 0.092894 0.093060 0.091604 0.097551 0.099167 0.122058 0.095185 0.089010 0.094221 0.100389 0.096914 0.071294 0.117442 0.120210 0.161993 0.167961 0.110237 0.099676 0.139406 0.141746 0.156596 0.157054 0.157795
qa: -0.2871 -0.4816 -0.2788 0.1562 -0.0311 -0.0868 -0.2774 -0.2907 -0.2864 0.3806 -0.0114 -0.2297 -0.2318 0.0898 -0.0923 -0.3061 -0.0160 0.1790 -0.0125 -0.0030 -0.1736 -0.2008 -0.1554 -0.1468 -0.1682 0.1008 0.0894 0.0981 0.0929 0.0931 0.0916 0.0976 0.0992 0.1221 0.0952 0.0890 0.0942 0.1004 0.0969 0.0713 0.1174 0.1202 0.1620 0.1680 0.1102 0.0997 0.1394 0.1417 0.1566 0.1571 0.1578
va: 2.1153 2.0135 2.2753 3.6968 3.8268 3.8045 3.8838 3.9143 3.8832 4.1678 3.7146 3.9293 3.9450 3.7992 3.6657 3.9901 3.9280 3.6580 3.7975 3.6428 3.9172 3.9363 3.8994 3.8878 3.8968 1.0289 1.0334 0.9993 1.0199 1.0012 1.0015 1.0029 0.9992 1.0037 0.9961 1.0065 0.9965 1.0001 0.9991 1.0122 0.9964 1.0118 1.0028 1.0091 1.0084 1.0046 1.0044 1.0024 0.9910 0.9905 0.9902
dispcorr: -0.023213815 hartree
energy: -1079.775548462905
dipole: -19.13022 19.62599 0.49577 -12.93485 12.42077 -0.51408 7.74645 -6.85359 0.89286
magnitude: 1.14336 au
magnitude: 2.90618 debye
