program: Orca
programVersion: 5.0.2
elementType: O O O C C C C C C C C C C C C C C C C C C C C C C H H H H H H H H H H H H H H H H H H H H H H H H H H
charge: 0
multiplicity: 1
keywords: wb97x-d3
keywords: def2-TZVPP
keywords: def2/J RIJCOSX
keywords: DEFGRID2
keywords: scfconv7
keywords: smallprint printgap noloewdin
keywords: NOSOSCF
formula: C22H26O3
InChI: InChI=1/C22H26O3/c1-15(2)10-19-20(22(19,3)4)21(23)25-14-17-12-18(24-13-17)11-16-8-6-5-7-9-16/h5-10,12-13,19-20H,11,14H2,1-4H3
51 atoms
O  -1.128329 1.379689 1.350383
O  -2.236069 1.875446 -0.524339
O  1.846277 2.884483 -1.428997
C  -1.284503 -1.497634 0.087063
C  -2.088261 -1.36904 1.338014
C  -2.281392 -0.354319 0.231389
C  0.202213 -1.24061 0.148932
C  -1.657711 -2.543405 -0.936005
C  -3.190938 -2.308747 1.672414
C  -1.887374 1.064996 0.30385
C  -4.29464 -1.982331 2.349917
C  -5.350136 -2.998415 2.662592
C  -4.568748 -0.600299 2.856961
C  -0.5138 2.682653 1.356428
C  0.639566 2.695324 0.420255
C  1.902664 2.05191 0.618337
C  0.668981 3.181017 -0.843119
C  2.591295 2.187783 -0.538672
C  3.87989 1.612038 -1.010475
C  3.6810 0.175429 -1.437213
C  4.04913 -0.867574 -0.593038
C  3.060686 -0.127788 -2.647214
C  3.802652 -2.187875 -0.946864
C  2.81143 -1.446073 -3.001998
C  3.179977 -2.480974 -2.151727
H  -1.525518 -1.001224 2.192193
H  -3.17684 -0.480444 -0.367414
H  0.489563 -0.587514 0.970037
H  0.728232 -2.186794 0.292705
H  0.568117 -0.799647 -0.780858
H  -1.201401 -3.505656 -0.693139
H  -2.734879 -2.694675 -1.010458
H  -1.298528 -2.25208 -1.925252
H  -3.066046 -3.340938 1.356263
H  -5.510239 -3.082588 3.740801
H  -5.095678 -3.987811 2.28216
H  -6.311742 -2.708922 2.230138
H  -4.608501 -0.593851 3.949793
H  -5.543801 -0.245321 2.513255
H  -3.81984 0.128288 2.550673
H  -0.191828 2.829303 2.38619
H  -1.242388 3.457093 1.116242
H  2.238884 1.535007 1.504059
H  -0.04102 3.740465 -1.431803
H  4.610358 1.659457 -0.201447
H  4.277668 2.208581 -1.834442
H  4.531931 -0.64632 0.351838
H  2.766542 0.671661 -3.317517
H  4.096835 -2.987433 -0.278713
H  2.327372 -1.666033 -3.945227
H  2.984528 -3.509182 -2.428139
elementType: O C H
totalener: -1079.74890020 hartree
nucrepener: 2193.08044626 hartree
electener: -3272.82934646 hartree
oneelecener: -5825.43748120 hartree
twoeener: 2552.60813474 hartree
cpcmener: -0.02501154 hartree
kineticenergy: 1074.86731954 hartree
xcener: -106.462663501972 hartree
chargesum: -0.0000000
charge: -0.281416 -0.468625 -0.273548 0.211573 0.001466 -0.136741 -0.327695 -0.299844 -0.310074 0.404288 -0.010987 -0.228728 -0.240433 0.067229 -0.043728 -0.405992 -0.017036 0.249866 -0.051988 0.011405 -0.164078 -0.179103 -0.170652 -0.161847 -0.161789 0.107706 0.093382 0.099042 0.101528 0.095442 0.097757 0.094298 0.097221 0.120635 0.094485 0.088763 0.094835 0.101469 0.094197 0.078905 0.118018 0.117754 0.161476 0.171167 0.105800 0.111762 0.137027 0.137738 0.155754 0.155999 0.156317
qa: -0.2814 -0.4686 -0.2735 0.2116 0.0015 -0.1367 -0.3277 -0.2998 -0.3101 0.4043 -0.0110 -0.2287 -0.2404 0.0672 -0.0437 -0.4060 -0.0170 0.2499 -0.0520 0.0114 -0.1641 -0.1791 -0.1707 -0.1618 -0.1618 0.1077 0.0934 0.0990 0.1015 0.0954 0.0978 0.0943 0.0972 0.1206 0.0945 0.0888 0.0948 0.1015 0.0942 0.0789 0.1180 0.1178 0.1615 0.1712 0.1058 0.1118 0.1370 0.1377 0.1558 0.1560 0.1563
va: 2.0937 2.0310 2.2789 3.6587 3.7938 3.8410 3.9055 3.9082 3.8860 4.1481 3.7059 3.9301 3.9361 3.8508 3.6197 3.9680 3.9669 3.5583 3.8167 3.6371 3.8856 3.9095 3.8753 3.8930 3.8635 1.0194 1.0297 1.0091 0.9997 0.9956 0.9999 1.0026 1.0027 1.0035 0.9958 1.0066 0.9968 0.9985 0.9998 1.0184 0.9945 1.0103 1.0085 1.0031 1.0102 1.0146 1.0043 1.0120 0.9921 0.9917 0.9911
dispcorr: -0.027501805 hartree
energy: -1079.776402008277
dipole: -14.80414 15.44130 0.63716 -18.83944 18.06215 -0.77729 8.72041 -7.68329 1.03712
magnitude: 1.44422 au
magnitude: 3.67092 debye
