program: Orca
programVersion: 5.0.2
elementType: O O O C C C C C C C C C C C C C C C C C C C C C C H H H H H H H H H H H H H H H H H H H H H H H H H H
charge: 0
multiplicity: 1
keywords: wb97x-d3
keywords: def2-TZVPP
keywords: def2/J RIJCOSX
keywords: DEFGRID2
keywords: scfconv7
keywords: smallprint printgap noloewdin
keywords: NOSOSCF
formula: C22H26O3
InChI: InChI=1/C22H26O3/c1-15(2)10-19-20(22(19,3)4)21(23)25-14-17-12-18(24-13-17)11-16-8-6-5-7-9-16/h5-10,12-13,19-20H,11,14H2,1-4H3
51 atoms
O  -1.88698 2.155981 0.767136
O  -2.211857 1.616835 -1.379493
O  2.470441 2.398217 0.784639
C  -4.09735 -0.616289 -0.22323
C  -2.731731 -1.167245 -0.432648
C  -2.904512 0.12309 0.358773
C  -4.856106 -0.05361 -1.399515
C  -4.992303 -1.268892 0.803432
C  -2.21003 -2.380545 0.24285
C  -2.325604 1.354242 -0.203718
C  -0.938427 -2.499351 0.635138
C  -0.416111 -3.752882 1.263363
C  0.045833 -1.375033 0.460591
C  -1.057173 3.274884 0.412529
C  0.358277 2.839907 0.267489
C  0.979249 2.161063 -0.832935
C  1.318694 2.948347 1.215697
C  2.258187 1.914893 -0.462951
C  3.38335 1.20496 -1.12812
C  3.503836 -0.234957 -0.682094
C  3.142477 -1.269896 -1.539088
C  3.954703 -0.553263 0.597677
C  3.227963 -2.594747 -1.130554
C  4.037152 -1.875454 1.009958
C  3.673105 -2.901724 0.146984
H  -2.330181 -0.994673 -1.42967
H  -2.796334 0.032295 1.433549
H  -5.478907 -0.834692 -1.840675
H  -5.519791 0.755501 -1.087999
H  -4.208175 0.32752 -2.185379
H  -5.525599 -2.116458 0.367406
H  -4.438416 -1.634735 1.668566
H  -5.740452 -0.561675 1.166878
H  -2.892586 -3.213991 0.383763
H  -1.188046 -4.515202 1.370999
H  0.004063 -3.551724 2.252462
H  0.396562 -4.176618 0.666498
H  1.036365 -1.647067 0.824505
H  -0.263675 -0.47993 1.004999
H  0.148742 -1.085249 -0.587069
H  -1.157491 3.973659 1.242025
H  -1.430252 3.765941 -0.486522
H  0.531038 1.891983 -1.775788
H  1.325066 3.386407 2.202174
H  4.319771 1.737071 -0.938727
H  3.216154 1.240502 -2.205243
H  2.789406 -1.03898 -2.537461
H  4.250058 0.235549 1.27948
H  2.944659 -3.386908 -1.812089
H  4.389164 -2.105293 2.007791
H  3.739611 -3.933312 0.468605
elementType: O C H
totalener: -1079.75045941 hartree
nucrepener: 2213.90896362 hartree
electener: -3293.65942302 hartree
oneelecener: -5867.23227384 hartree
twoeener: 2573.57285082 hartree
cpcmener: -0.02275978 hartree
kineticenergy: 1074.85798187 hartree
xcener: -106.461760173624 hartree
chargesum: -0.0000000
charge: -0.287099 -0.479313 -0.277935 0.157845 0.008903 -0.107761 -0.280512 -0.285471 -0.348909 0.387408 0.066075 -0.235197 -0.302489 0.069996 -0.067162 -0.351699 -0.035432 0.245465 -0.053874 0.040543 -0.221889 -0.192711 -0.114949 -0.130509 -0.203116 0.102595 0.095981 0.092769 0.097331 0.092154 0.098702 0.091603 0.097190 0.120461 0.090674 0.101019 0.094191 0.085151 0.109539 0.105399 0.117599 0.116749 0.159671 0.173228 0.116351 0.101235 0.137556 0.136809 0.155303 0.154568 0.155961
qa: -0.2871 -0.4793 -0.2779 0.1578 0.0089 -0.1078 -0.2805 -0.2855 -0.3489 0.3874 0.0661 -0.2352 -0.3025 0.0700 -0.0672 -0.3517 -0.0354 0.2455 -0.0539 0.0405 -0.2219 -0.1927 -0.1149 -0.1305 -0.2031 0.1026 0.0960 0.0928 0.0973 0.0922 0.0987 0.0916 0.0972 0.1205 0.0907 0.1010 0.0942 0.0852 0.1095 0.1054 0.1176 0.1167 0.1597 0.1732 0.1164 0.1012 0.1376 0.1368 0.1553 0.1546 0.1560
va: 2.1026 2.0221 2.2768 3.7221 3.7906 3.8057 3.8860 3.9086 3.9071 4.1545 3.6372 3.9159 3.9707 3.8558 3.6502 3.9623 3.9673 3.5810 3.8042 3.5997 3.9064 3.9413 3.8174 3.8662 3.8834 1.0273 1.0324 1.0009 0.9995 1.0207 0.9998 1.0026 1.0032 1.0050 1.0091 0.9939 0.9948 1.0157 1.0042 0.9934 0.9967 1.0108 1.0208 0.9949 1.0067 1.0134 1.0054 1.0158 0.9907 0.9916 0.9921
dispcorr: -0.028349610 hartree
energy: -1079.778809016456
dipole: -13.06228 13.33116 0.26888 -16.72402 16.42579 -0.29823 1.59902 -0.87817 0.72085
magnitude: 0.82515 au
magnitude: 2.09736 debye
