program: Gaussian 09
title: 000072851
version: EM64L-G09RevD.01
frameworkgroup: C1[X(C8H9BrO)]
method: RPBEPBE
basis: SDD
operation: Freq
keyword: #p
keyword: freq=noraman
keyword: PBEPBE/SDD
title: #p freq=noraman PBEPBE/SDD
converged: YES YES NO NO
title: Mulliken charges:
elementType: Br O C C C C C C C C H H H H H H H H H
charge: -0.007218 -0.465339 -0.534143 0.474802 -0.307633 -0.429017 -0.368602 -0.176947 -0.185700 -0.211992 0.237070 0.201395 0.199639 0.204869 0.235383 0.288588 0.248053 0.247006 0.349785
chargesum: 0.00000
title: Mulliken charges with hydrogens summed into heavy atoms:
elementType: Br O C C C C C C C C
charge: -0.007218 -0.115555 -0.095677 0.474802 0.096876 -0.193634 -0.080014 0.071107 0.061306 -0.211992
polarizability: 1.58990836e+02 -5.31268308e+00 9.60672661e+01 4.71840999e+00 5.09174514e+00 5.31563382e+01
1716.lowfreq: -16.4517 -6.8696 -2.5191 0.0006 0.0007 0.0007 30.0736 76.5605 108.5127
frequency: 29.9025 76.5571 108.5006 181.1847 197.5239 247.0532 272.2338 315.0173 345.9666 408.5923 435.3353 518.7864 587.9019 624.2993 717.0259 761.0821 825.5805 836.4964 843.2106 951.3004 951.9071 974.5309 994.5390 1002.3817 1047.2141 1060.5228 1107.8085 1164.2941 1188.4938 1196.0055 1220.8402 1257.7944 1299.1035 1337.3547 1373.1070 1393.1460 1399.6955 1451.2110 1469.3385 1477.6969 1579.5170 1596.1317 2944.1523 2986.9421 3006.6036 3049.5530 3126.8027 3156.0162 3168.2660 3175.9183 3576.0462
redmass: 4.1565 4.2679 5.3109 2.8673 6.0830 1.2376 5.7892 4.9322 2.7671 2.8730 2.3628 3.2427 3.5301 6.6689 3.5063 4.0172 1.4237 1.3967 2.2859 1.4689 1.8094 1.3730 4.9557 3.2072 1.9284 2.4607 1.4063 1.1198 1.1596 1.3774 1.5185 1.2464 1.2728 1.6395 6.6137 2.1280 1.4374 1.1179 1.8105 1.2645 7.2172 6.0964 1.0556 1.0712 1.0964 1.1005 1.0895 1.0887 1.0951 1.0971 1.0665
irintensity: 0.4338 2.1238 5.6559 22.5609 2.4483 117.5955 25.4381 3.7535 7.3043 0.1818 12.4799 26.9514 20.6720 0.4222 5.2841 15.4998 42.0586 15.0758 24.1438 0.9882 4.7437 0.5748 44.8004 55.2606 18.9922 19.2826 9.1344 12.2308 1.5149 14.5362 1.7112 23.7657 2.3822 4.2986 0.3637 8.0281 2.9191 16.1289 55.9401 38.7093 0.7660 6.2677 82.3994 5.9571 98.2224 21.2183 14.1365 1.3584 8.4282 1.5986 3.9240
temp: 298.150 k
press: 1.00000 atm
elementType: 35 8 6 6 6 6 6 6 6 6 1 1 1 1 1 1 1 1 1
symmnumber: 1
zpe: 388884.9 jmol-1
zpe.correction: 0.148118 hartree
zpe.thermalcorrener: 0.158141 hartree
zpe.thermalcorrenthalpy: 0.159085 hartree
zpe.thermalcorrgfe: 0.110659 hartree
zpe.sumelectzpe: -398.179032 hartree
zpe.sumelectthermal: -398.169010 hartree
zpe.sumelectthermalent: -398.168066 hartree
zpe.sumelectthermalfe: -398.216492 hartree
dipole: -3.7157 0.7993 1.3861
dipole: 4.0456
quadrupole: -59.8862 -61.9893 -70.0013
quadrupole: -0.6007 -6.4482 -0.9322
quadrupole: 4.0727 1.9696 -6.0424 -0.6007 -6.4482 -0.9322
hfenergy: -398.3271508 hartree
pointgroup: C01 [X(C8H9Br1O1)]
dipole: -1.4736921 -0.4163322 -0.4338913 debye
dipolederiv: -0.7582412 -0.1094318 0.0956365 -0.1173006 -0.1024232 0.0144807 0.1097203 0.0158023 -0.0698616 -0.5649846 0.0764798 0.1874931 0.1164884 -0.7696718 0.0261405 0.1937616 -0.0249653 -0.2806696 -0.0131493 0.0520071 -0.0469947 0.1404869 0.1076396 0.0163239 -0.0935127 0.0567805 0.0373903 0.3168679 0.0144926 -0.0388414 0.0610253 -0.0688685 0.0129867 -0.0900689 0.0200176 -0.0566776 0.3755454 -0.0599322 -0.0547968 -0.1333728 0.6624163 -0.0077174 0.0212167 -0.0140564 0.2937622 -0.0570749 0.0398221 -0.0309658 -0.0173084 0.0708825 0.0130278 -0.0174142 0.0031739 -0.1559277 -0.0520757 -0.0643467 -0.029863 -0.0308905 0.0236535 -0.0018108 0.0036039 0.0015334 -0.1435208 -0.3566718 -0.1558702 0.0218453 -0.0985545 -0.014453 0.0181357 0.0377452 0.0287957 -0.097942 -0.3894113 0.0416997 0.0416714 -0.0399066 0.042978 0.0260169 0.045981 0.0015939 -0.1065027 1.2598931 0.2076918 -0.2051658 0.2227083 0.0655537 -0.0225093 -0.2140855 -0.0226835 -0.0953686 -0.0358834 -0.0027454 0.0494535 0.006775 0.0793754 -0.0922487 0.0775339 -0.036845 -0.0697322 0.0289273 0.0130609 -0.009288 -0.079625 -0.1490605 0.0336382 -0.0261799 -0.0109599 0.094971 -0.2852992 -0.115722 -0.0005864 -0.0589102 -0.069276 0.0032995 0.0007809 0.0145631 0.0622236 0.0725516 0.0391257 0.0957891 0.0292743 -0.0492785 -0.041479 0.0535173 -0.0743303 -0.1666235 0.022276 -0.0966765 0.0189234 -0.076513 -0.0797366 -0.0003973 0.0198888 0.0024199 0.147322 0.083492 0.0520374 0.0448424 0.0473019 0.0267765 -0.0111188 0.038717 -0.0091608 0.150925 0.0249677 0.0820813 0.0248715 0.0792895 0.0078272 -0.0215791 0.0268279 -0.0225277 0.157157 0.0698673 -0.0612375 0.0076679 -0.061983 -0.0401896 -0.0045244 0.0120532 -0.0027899 0.1570653 0.2584031 0.0474637 -0.171692 0.0110151 0.2558551 0.0393351 -0.2000865 0.0736385 0.14201 unknown
polarizability: 157.9709609|6.2714362|96.9452531|-10.292913|-0.6971741|53.2982262 unknown
InChI: InChI=1S/C8H9BrO/c9-8-3-1-7(2-4-8)5-6-10/h1-4,10H,5-6H2
charge 0 multiplicity 1
19 atoms
Br 4.010658 0.40282 -0.374535
O  -3.113405 1.357459 -0.274992
C  -2.141451 -0.695627 0.589195
C  -0.661608 -0.424277 0.357527
C  -3.074814 -0.102676 -0.482266
C  0.242855 -1.494773 0.142567
C  -0.150092 0.900781 0.352144
C  1.621846 -1.264419 -0.07532
C  1.223359 1.15188 0.135637
C  2.093193 0.062494 -0.075755
H  -2.465688 -0.281933 1.564023
H  -2.317455 -1.787345 0.628408
H  -4.091911 -0.531766 -0.358489
H  -2.700892 -0.350224 -1.497981
H  -0.12586 -2.527818 0.145569
H  -0.840699 1.734925 0.506248
H  2.3076 -2.10075 -0.238364
H  1.605986 2.176703 0.133583
H  -3.625023 1.784444 -1.0065
