program: Orca
programVersion: 5.0.2
elementType: O O O C C C C C C C C C C C C C C C C C C C C C C H H H H H H H H H H H H H H H H H H H H H H H H H H
charge: 0
multiplicity: 1
keywords: wb97x-d3
keywords: def2-TZVPP
keywords: def2/J RIJCOSX
keywords: DEFGRID2
keywords: scfconv7
keywords: smallprint printgap noloewdin
keywords: NOSOSCF
formula: C22H26O3
InChI: InChI=1/C22H26O3/c1-15(2)10-19-20(22(19,3)4)21(23)25-14-17-12-18(24-13-17)11-16-8-6-5-7-9-16/h5-10,12-13,19-20H,11,14H2,1-4H3
51 atoms
O  -1.360041 1.988979 0.934345
O  -2.260359 1.419865 -1.031641
O  2.063346 2.117241 -1.833185
C  -4.147803 -0.187517 0.96362
C  -3.271053 -1.098255 0.156127
C  -2.651006 0.065518 0.902252
C  -5.103295 0.721816 0.23085
C  -4.684167 -0.650977 2.296304
C  -2.954488 -2.478169 0.571385
C  -2.090785 1.203245 0.145653
C  -2.918371 -3.559641 -0.214609
C  -2.565986 -4.903698 0.349553
C  -3.204263 -3.564618 -1.685423
C  -0.706938 3.12225 0.337084
C  0.573172 2.733559 -0.312238
C  1.845392 2.559986 0.321116
C  0.774517 2.446813 -1.620445
C  2.714758 2.1871 -0.647573
C  4.159641 1.831881 -0.627754
C  4.409828 0.380881 -0.285838
C  5.088586 0.040676 0.879688
C  3.967053 -0.640296 -1.124731
C  5.325078 -1.289658 1.202937
C  4.199549 -1.969343 -0.803172
C  4.88064 -2.299077 0.362282
H  -3.345137 -0.937572 -0.913799
H  -2.116871 -0.17153 1.816319
H  -6.073191 0.230434 0.128799
H  -5.264166 1.649493 0.784719
H  -4.766685 0.982756 -0.770757
H  -3.96065 -1.228576 2.870446
H  -4.975604 0.205384 2.907834
H  -5.570767 -1.273425 2.157271
H  -2.718307 -2.617845 1.622409
H  -2.340834 -4.859067 1.415219
H  -1.69649 -5.328716 -0.159587
H  -3.383175 -5.616382 0.208114
H  -2.316055 -3.863285 -2.248077
H  -3.536888 -2.605519 -2.076556
H  -3.976619 -4.301291 -1.921238
H  -0.524851 3.802548 1.167745
H  -1.374339 3.623254 -0.364618
H  2.077906 2.70216 1.36535
H  0.124642 2.44925 -2.481395
H  4.660975 2.46574 0.104935
H  4.605101 2.068572 -1.597686
H  5.439277 0.823557 1.541986
H  3.439175 -0.399098 -2.040003
H  5.857377 -1.534683 2.113384
H  3.850301 -2.751094 -1.465699
H  5.063968 -3.336462 0.611244
elementType: O C H
totalener: -1079.75414857 hartree
nucrepener: 2075.44409684 hartree
electener: -3155.19824541 hartree
oneelecener: -5590.35816073 hartree
twoeener: 2435.15991532 hartree
cpcmener: -0.02507775 hartree
kineticenergy: 1074.85714024 hartree
xcener: -106.459633574478 hartree
chargesum: -0.0000000
charge: -0.283523 -0.477423 -0.275184 0.092026 0.041228 -0.091616 -0.269996 -0.271863 -0.274074 0.402703 -0.048977 -0.217721 -0.252687 0.088670 -0.088069 -0.328309 -0.011157 0.221951 -0.060937 0.016683 -0.182379 -0.193152 -0.150872 -0.153080 -0.174345 0.086702 0.088658 0.096075 0.097457 0.090172 0.088178 0.096647 0.097329 0.115100 0.087405 0.091890 0.092863 0.097424 0.090196 0.092978 0.120399 0.118151 0.159910 0.169640 0.102781 0.114538 0.138964 0.137988 0.156561 0.157291 0.156805
qa: -0.2835 -0.4774 -0.2752 0.0920 0.0412 -0.0916 -0.2700 -0.2719 -0.2741 0.4027 -0.0490 -0.2177 -0.2527 0.0887 -0.0881 -0.3283 -0.0112 0.2220 -0.0609 0.0167 -0.1824 -0.1932 -0.1509 -0.1531 -0.1743 0.0867 0.0887 0.0961 0.0975 0.0902 0.0882 0.0966 0.0973 0.1151 0.0874 0.0919 0.0929 0.0974 0.0902 0.0930 0.1204 0.1182 0.1599 0.1696 0.1028 0.1145 0.1390 0.1380 0.1566 0.1573 0.1568
va: 2.1228 2.0276 2.2797 3.7106 3.7671 3.8196 3.9034 3.9106 3.8805 4.1929 3.7654 3.9216 3.9415 3.8095 3.6327 3.9984 3.9392 3.5959 3.8028 3.6622 3.9306 3.9432 3.8941 3.9026 3.9032 1.0376 1.0349 1.0002 0.9999 1.0192 1.0064 1.0019 1.0016 1.0122 1.0092 0.9960 0.9964 0.9963 1.0102 0.9975 0.9946 1.0129 1.0074 1.0049 1.0095 1.0090 1.0039 1.0157 0.9912 0.9913 0.9910
dispcorr: -0.021660463 hartree
energy: -1079.775809029691
dipole: -21.13111 21.30464 0.17353 -18.81769 18.73531 -0.08238 5.12336 -4.13380 0.98956
magnitude: 1.00803 au
magnitude: 2.56220 debye
