program: Orca
programVersion: 5.0.2
elementType: O O O C C C C C C C C C C C C C C C C C C C C C C H H H H H H H H H H H H H H H H H H H H H H H H H H
charge: 0
multiplicity: 1
keywords: wb97x-d3
keywords: def2-TZVPP
keywords: def2/J RIJCOSX
keywords: DEFGRID2
keywords: scfconv7
keywords: smallprint printgap noloewdin
keywords: NOSOSCF
formula: C22H26O3
InChI: InChI=1/C22H26O3/c1-15(2)10-19-20(22(19,3)4)21(23)25-14-17-12-18(24-13-17)11-16-8-6-5-7-9-16/h5-10,12-13,19-20H,11,14H2,1-4H3
51 atoms
O  -1.675871 2.165063 0.382767
O  -0.762085 0.826524 1.922453
O  2.783201 2.39848 -0.096745
C  -2.178563 -1.297069 -0.000018
C  -2.847823 -1.22549 1.3424
C  -2.585946 0.04922 0.574812
C  -0.724268 -1.693796 -0.056619
C  -2.965268 -1.768851 -1.198864
C  -4.24306 -1.663644 1.555028
C  -1.576994 1.016491 1.051341
C  -4.667045 -2.534948 2.475877
C  -6.121897 -2.876545 2.598784
C  -3.776199 -3.231841 3.459424
C  -0.709762 3.189362 0.652336
C  0.618215 2.840299 0.084647
C  0.911561 2.488066 -1.273002
C  1.794281 2.759267 0.746173
C  2.238584 2.226152 -1.324186
C  3.135437 1.743962 -2.403026
C  3.684409 0.361061 -2.129592
C  2.847759 -0.655931 -1.675376
C  5.028312 0.07377 -2.342851
C  3.341823 -1.929599 -1.439245
C  5.526719 -1.202682 -2.111168
C  4.685514 -2.208212 -1.656939
H  -2.173183 -1.384486 2.176828
H  -3.441666 0.503771 0.086359
H  -0.163908 -1.413253 0.833262
H  -0.642011 -2.777445 -0.164135
H  -0.232984 -1.242344 -0.921381
H  -2.99182 -2.860135 -1.235032
H  -3.994885 -1.413292 -1.198102
H  -2.499273 -1.420028 -2.122744
H  -4.987426 -1.223727 0.897164
H  -6.738863 -2.319146 1.893757
H  -6.491117 -2.666556 3.606573
H  -6.291891 -3.942674 2.425416
H  -3.992869 -4.302937 3.479663
H  -3.954862 -2.863548 4.474057
H  -2.714247 -3.118048 3.248443
H  -0.641174 3.390762 1.723162
H  -1.121663 4.077064 0.172617
H  0.218751 2.426226 -2.098067
H  2.066129 2.926701 1.777048
H  3.963489 2.442035 -2.554119
H  2.56339 1.740872 -3.334047
H  1.798018 -0.45145 -1.499146
H  5.694485 0.854684 -2.69113
H  2.674624 -2.704493 -1.082065
H  6.57615 -1.408082 -2.281013
H  5.073858 -3.201298 -1.470071
elementType: O C H
totalener: -1079.75405886 hartree
nucrepener: 2115.99079504 hartree
electener: -3195.74485391 hartree
oneelecener: -5671.28956660 hartree
twoeener: 2475.54471269 hartree
cpcmener: -0.02707224 hartree
kineticenergy: 1074.86457168 hartree
xcener: -106.463076310396 hartree
chargesum: -0.0000000
charge: -0.281539 -0.462984 -0.277441 0.138242 0.044322 -0.121694 -0.309497 -0.267438 -0.288175 0.391401 -0.034779 -0.222081 -0.258493 0.094625 -0.052549 -0.346578 -0.034043 0.203849 -0.052137 -0.022827 -0.141719 -0.147496 -0.191420 -0.169921 -0.147227 0.089806 0.089395 0.097072 0.102090 0.101286 0.096923 0.087793 0.097609 0.117485 0.087459 0.092760 0.093528 0.092017 0.100006 0.091543 0.117187 0.118694 0.156726 0.173463 0.103596 0.107923 0.135806 0.139475 0.155299 0.155178 0.157479
qa: -0.2815 -0.4630 -0.2774 0.1382 0.0443 -0.1217 -0.3095 -0.2674 -0.2882 0.3914 -0.0348 -0.2221 -0.2585 0.0946 -0.0525 -0.3466 -0.0340 0.2038 -0.0521 -0.0228 -0.1417 -0.1475 -0.1914 -0.1699 -0.1472 0.0898 0.0894 0.0971 0.1021 0.1013 0.0969 0.0878 0.0976 0.1175 0.0875 0.0928 0.0935 0.0920 0.1000 0.0915 0.1172 0.1187 0.1567 0.1735 0.1036 0.1079 0.1358 0.1395 0.1553 0.1552 0.1575
va: 2.1169 2.0458 2.2761 3.6837 3.7720 3.8588 3.9030 3.9015 3.8820 4.2009 3.7372 3.9249 3.9440 3.8380 3.6059 3.9761 3.9651 3.6216 3.8341 3.7317 3.8809 3.8941 3.9198 3.9125 3.8888 1.0342 1.0373 1.0174 1.0015 0.9948 1.0025 1.0053 1.0027 1.0098 1.0090 0.9951 0.9965 0.9982 0.9956 1.0077 1.0064 0.9890 1.0117 0.9967 1.0091 1.0038 0.9977 1.0024 0.9937 0.9917 0.9905
dispcorr: -0.023927843 hartree
energy: -1079.777986706465
dipole: -21.04529 20.35365 -0.69164 -20.68379 20.70497 0.02118 3.72953 -4.67930 -0.94977
magnitude: 1.17511 au
magnitude: 2.98689 debye
