program: Orca
programVersion: 5.0.2
elementType: O O O C C C C C C C C C C C C C C C C C C C C C C H H H H H H H H H H H H H H H H H H H H H H H H H H
charge: 0
multiplicity: 1
keywords: wb97x-d3
keywords: def2-TZVPP
keywords: def2/J RIJCOSX
keywords: DEFGRID2
keywords: scfconv7
keywords: smallprint printgap noloewdin
keywords: NOSOSCF
formula: C22H26O3
InChI: InChI=1/C22H26O3/c1-15(2)10-19-20(22(19,3)4)21(23)25-14-17-12-18(24-13-17)11-16-8-6-5-7-9-16/h5-10,12-13,19-20H,11,14H2,1-4H3
51 atoms
O  -2.061003 1.982624 -0.398838
O  -2.17226 2.110539 1.826956
O  2.117236 2.085163 0.74679
C  -3.990146 -0.422459 -0.166535
C  -2.57545 -0.869009 -0.280662
C  -2.956302 0.146502 0.791094
C  -4.588996 0.421849 -1.264249
C  -4.997231 -1.344407 0.480201
C  -2.081177 -2.209543 0.115623
C  -2.380056 1.502278 0.80071
C  -0.816311 -2.4211 0.491457
C  -0.30588 -3.786652 0.827679
C  0.171156 -1.2904 0.585461
C  -1.185026 3.122731 -0.448428
C  0.221382 2.684884 -0.235896
C  1.117041 2.158788 -1.223186
C  0.888956 2.605801 0.940342
C  2.25278 1.813255 -0.572779
C  3.526382 1.188178 -1.017855
C  3.576653 -0.286925 -0.695749
C  4.024089 -0.7340 0.544386
C  3.134923 -1.223003 -1.626516
C  4.030396 -2.089273 0.846796
C  3.138926 -2.578066 -1.327056
C  3.587069 -3.015677 -0.087711
H  -2.033352 -0.424604 -1.112142
H  -3.029102 -0.247943 1.798565
H  -5.34245 1.105456 -0.867589
H  -3.853579 1.010234 -1.807784
H  -5.085921 -0.224523 -1.990884
H  -4.570226 -1.924723 1.298491
H  -5.834008 -0.772245 0.885662
H  -5.403052 -2.047724 -0.25015
H  -2.769526 -3.047895 0.058971
H  0.515508 -4.070251 0.163522
H  -1.080978 -4.549274 0.748008
H  0.098027 -3.816987 1.843185
H  -0.197965 -0.483625 1.22321
H  0.372672 -0.849933 -0.39377
H  1.125549 -1.620457 0.994977
H  -1.490833 3.880957 0.272033
H  -1.318738 3.534468 -1.447164
H  0.932268 2.058347 -2.281672
H  0.634907 2.88604 1.950607
H  4.373749 1.703178 -0.557509
H  3.614504 1.335432 -2.095023
H  4.375182 -0.019362 1.279743
H  2.785604 -0.888425 -2.596618
H  4.380692 -2.422171 1.815715
H  2.794297 -3.292908 -2.063711
H  3.591408 -4.072313 0.147827
elementType: O C H
totalener: -1079.74870583 hartree
nucrepener: 2231.94007005 hartree
electener: -3311.68877588 hartree
oneelecener: -5903.07721789 hartree
twoeener: 2591.38844201 hartree
cpcmener: -0.02412206 hartree
kineticenergy: 1074.86399152 hartree
xcener: -106.463828200874 hartree
chargesum: -0.0000000
charge: -0.280637 -0.474005 -0.274962 0.155256 0.025293 -0.102777 -0.273402 -0.290833 -0.352339 0.366934 0.076944 -0.237371 -0.333737 0.073429 -0.052284 -0.351433 -0.020758 0.211377 -0.056110 0.065408 -0.196187 -0.221480 -0.131806 -0.122309 -0.206801 0.097762 0.092320 0.098854 0.092127 0.092624 0.091262 0.098501 0.098725 0.121751 0.093105 0.091859 0.100407 0.112800 0.101039 0.102639 0.120098 0.111461 0.155874 0.166900 0.114855 0.108902 0.136807 0.136542 0.154060 0.155374 0.157942
qa: -0.2806 -0.4740 -0.2750 0.1553 0.0253 -0.1028 -0.2734 -0.2908 -0.3523 0.3669 0.0769 -0.2374 -0.3337 0.0734 -0.0523 -0.3514 -0.0208 0.2114 -0.0561 0.0654 -0.1962 -0.2215 -0.1318 -0.1223 -0.2068 0.0978 0.0923 0.0989 0.0921 0.0926 0.0913 0.0985 0.0987 0.1218 0.0931 0.0919 0.1004 0.1128 0.1010 0.1026 0.1201 0.1115 0.1559 0.1669 0.1149 0.1089 0.1368 0.1365 0.1541 0.1554 0.1579
va: 2.0966 2.0247 2.2712 3.7361 3.7504 3.8164 3.8828 3.9124 3.8848 4.1846 3.6063 3.9182 3.9876 3.8306 3.6097 3.9779 3.9332 3.5892 3.8063 3.5480 3.9460 3.9023 3.8570 3.8157 3.8684 1.0268 1.0297 1.0001 1.0155 1.0008 1.0023 1.0026 0.9995 1.0054 0.9949 1.0099 0.9942 1.0024 0.9911 1.0102 1.0126 0.9974 1.0095 1.0072 1.0088 1.0109 1.0105 1.0057 0.9916 0.9904 0.9910
dispcorr: -0.029387139 hartree
energy: -1079.778092968711
dipole: -11.62067 11.93132 0.31065 -16.23701 15.67780 -0.55921 -2.87423 1.47185 -1.40238
magnitude: 1.54139 au
magnitude: 3.91790 debye
