program: Orca
programVersion: 5.0.2
elementType: O O O C C C C C C C C C C C C C C C C C C C C C C H H H H H H H H H H H H H H H H H H H H H H H H H H
charge: 0
multiplicity: 1
keywords: wb97x-d3
keywords: def2-TZVPP
keywords: def2/J RIJCOSX
keywords: DEFGRID2
keywords: scfconv7
keywords: smallprint printgap noloewdin
keywords: NOSOSCF
formula: C22H26O3
InChI: InChI=1/C22H26O3/c1-15(2)10-19-20(22(19,3)4)21(23)25-14-17-12-18(24-13-17)11-16-8-6-5-7-9-16/h5-10,12-13,19-20H,11,14H2,1-4H3
51 atoms
O  -1.140581 1.369725 1.43181
O  -0.985251 -0.859735 1.526573
O  2.546532 2.19271 -0.960563
C  -3.524667 -0.546659 -0.342947
C  -3.897425 -1.079424 1.009209
C  -3.051545 0.173443 0.908689
C  -2.550677 -1.338885 -1.180758
C  -4.551013 0.183672 -1.174518
C  -5.263782 -0.987408 1.559004
C  -1.63403 0.138741 1.316863
C  -5.932585 -1.952672 2.198818
C  -7.317015 -1.708185 2.721522
C  -5.408302 -3.330745 2.465444
C  0.241093 1.52579 1.795044
C  1.132425 1.499248 0.604739
C  1.459401 0.397855 -0.254867
C  1.825429 2.555702 0.119044
C  2.317531 0.877517 -1.185094
C  3.037608 0.241687 -2.318371
C  4.525251 0.162002 -2.070953
C  5.388603 1.124404 -2.584119
C  5.052562 -0.865758 -1.293077
C  6.752816 1.06018 -2.32945
C  6.414545 -0.933951 -1.038779
C  7.269988 0.03075 -1.555846
H  -3.336919 -1.961904 1.298076
H  -3.55304 1.115559 1.103907
H  -1.946966 -0.679757 -1.808685
H  -1.873508 -1.953257 -0.590736
H  -3.099712 -2.009525 -1.844983
H  -5.20177 0.827706 -0.584201
H  -4.058492 0.813404 -1.918211
H  -5.18472 -0.52567 -1.71115
H  -5.763784 -0.030958 1.435072
H  -8.037061 -2.391751 2.263377
H  -7.65639 -0.689249 2.534817
H  -7.367277 -1.887353 3.79912
H  -6.103035 -4.083957 2.08665
H  -5.322687 -3.508501 3.540231
H  -4.436284 -3.530646 2.020742
H  0.527576 0.770733 2.528346
H  0.29737 2.49891 2.281472
H  1.108198 -0.618955 -0.186619
H  1.89897 3.586076 0.432009
H  2.84279 0.791994 -3.243093
H  2.624831 -0.759161 -2.454239
H  4.994014 1.929021 -3.193628
H  4.391456 -1.622082 -0.885167
H  7.412213 1.815401 -2.738434
H  6.809335 -1.7431 -0.437262
H  8.333145 -0.022357 -1.358864
elementType: O C H
totalener: -1079.75542950 hartree
nucrepener: 2038.64103211 hartree
electener: -3118.39646161 hartree
oneelecener: -5516.50885353 hartree
twoeener: 2398.11239192 hartree
cpcmener: -0.02523221 hartree
kineticenergy: 1074.85505594 hartree
xcener: -106.460110343341 hartree
chargesum: 0.0000000
charge: -0.280053 -0.475851 -0.279236 0.110144 0.032685 -0.095600 -0.280201 -0.271649 -0.273914 0.409708 -0.049250 -0.218957 -0.253151 0.068445 -0.080091 -0.313003 -0.036985 0.201719 -0.060524 0.054541 -0.192461 -0.199416 -0.158150 -0.155586 -0.171242 0.090037 0.089081 0.096750 0.091806 0.098211 0.087124 0.097614 0.097484 0.115809 0.093460 0.087907 0.091937 0.093576 0.097258 0.090280 0.119333 0.114860 0.161337 0.174345 0.112422 0.114410 0.139754 0.142259 0.156304 0.157260 0.157456
qa: -0.2801 -0.4759 -0.2792 0.1101 0.0327 -0.0956 -0.2802 -0.2716 -0.2739 0.4097 -0.0492 -0.2190 -0.2532 0.0684 -0.0801 -0.3130 -0.0370 0.2017 -0.0605 0.0545 -0.1925 -0.1994 -0.1581 -0.1556 -0.1712 0.0900 0.0891 0.0968 0.0918 0.0982 0.0871 0.0976 0.0975 0.1158 0.0935 0.0879 0.0919 0.0936 0.0973 0.0903 0.1193 0.1149 0.1613 0.1743 0.1124 0.1144 0.1398 0.1423 0.1563 0.1573 0.1575
va: 2.1226 2.0280 2.2817 3.6919 3.7775 3.8359 3.9044 3.9057 3.8762 4.1725 3.7670 3.9215 3.9420 3.8551 3.6815 4.0055 3.9716 3.6644 3.8172 3.5784 3.9558 3.9446 3.8998 3.9008 3.9002 1.0342 1.0354 1.0004 1.0169 1.0016 1.0068 1.0015 1.0016 1.0117 0.9964 1.0090 0.9962 0.9976 0.9962 1.0104 1.0074 0.9986 1.0180 0.9943 1.0061 1.0081 1.0060 1.0035 0.9911 0.9908 0.9905
dispcorr: -0.022055580 hartree
energy: -1079.777485075820
dipole: -29.89699 29.28741 -0.60959 -12.68006 13.07151 0.39145 2.05261 -2.33720 -0.28460
magnitude: 0.77835 au
magnitude: 1.97841 debye
