program: Orca
programVersion: 5.0.2
elementType: O O O C C C C C C C C C C C C C C C C C C C C C C H H H H H H H H H H H H H H H H H H H H H H H H H H
charge: 0
multiplicity: 1
keywords: wb97x-d3
keywords: def2-TZVPP
keywords: def2/J RIJCOSX
keywords: DEFGRID2
keywords: scfconv7
keywords: smallprint printgap noloewdin
keywords: NOSOSCF
formula: C22H26O3
InChI: InChI=1/C22H26O3/c1-15(2)10-19-20(22(19,3)4)21(23)25-14-17-12-18(24-13-17)11-16-8-6-5-7-9-16/h5-10,12-13,19-20H,11,14H2,1-4H3
51 atoms
O  -2.065102 2.006757 -0.408057
O  -2.228042 2.107985 1.816225
O  2.082962 2.027013 0.788643
C  -3.865925 -0.471292 -0.311916
C  -2.434714 -0.876428 -0.267273
C  -2.9594 0.144992 0.739701
C  -4.374128 0.338397 -1.480404
C  -4.90671 -1.417819 0.24008
C  -1.948768 -2.192357 0.213293
C  -2.405762 1.508996 0.77895
C  -0.73734 -2.354447 0.754014
C  -0.245952 -3.692494 1.208079
C  0.197745 -1.191091 0.945656
C  -1.185043 3.143779 -0.427121
C  0.215817 2.693353 -0.205594
C  1.126553 2.202545 -1.196343
C  0.857994 2.556203 0.979624
C  2.244269 1.814997 -0.5383
C  3.513922 1.183051 -0.98238
C  3.515736 -0.30659 -0.731473
C  4.085855 -0.83969 0.419556
C  2.905689 -1.168227 -1.639858
C  4.052793 -2.208453 0.656466
C  2.87002 -2.534861 -1.406158
C  3.446125 -3.060118 -0.256118
H  -1.817798 -0.428021 -1.042661
H  -3.120646 -0.235543 1.742221
H  -3.594432 0.902541 -1.98583
H  -4.820357 -0.329587 -2.220085
H  -5.149401 1.039817 -1.165398
H  -5.805849 -0.871466 0.531867
H  -5.19867 -2.150791 -0.514799
H  -4.557094 -1.964033 1.116371
H  -2.601474 -3.052691 0.096452
H  0.67091 -3.971967 0.68215
H  -0.981914 -4.480362 1.046567
H  0.005262 -3.676104 2.272288
H  1.152046 -1.50528 1.368155
H  -0.227101 -0.443651 1.620953
H  0.408105 -0.68038 0.003548
H  -1.496582 3.891343 0.301974
H  -1.304189 3.573044 -1.420322
H  0.961944 2.151605 -2.261731
H  0.583189 2.79329 1.995429
H  4.361665 1.650232 -0.474753
H  3.634635 1.381427 -2.048412
H  4.564781 -0.182529 1.136198
H  2.452958 -0.76466 -2.538632
H  4.503357 -2.609605 1.555546
H  2.395203 -3.191259 -2.124609
H  3.424078 -4.12722 -0.075023
elementType: O C H
totalener: -1079.74856894 hartree
nucrepener: 2241.67576961 hartree
electener: -3321.42433855 hartree
oneelecener: -5922.53250231 hartree
twoeener: 2601.10816376 hartree
cpcmener: -0.02412279 hartree
kineticenergy: 1074.86480550 hartree
xcener: -106.463737705597 hartree
chargesum: -0.0000000
charge: -0.280797 -0.473773 -0.272823 0.162943 0.009487 -0.090424 -0.275434 -0.292594 -0.347504 0.358448 0.067748 -0.232804 -0.326326 0.072520 -0.057362 -0.328166 -0.026194 0.197322 -0.057467 0.062675 -0.194042 -0.210110 -0.136737 -0.134525 -0.203888 0.102638 0.091064 0.091560 0.091674 0.099913 0.098237 0.098951 0.092316 0.122038 0.093218 0.090075 0.101982 0.109590 0.116111 0.086005 0.120222 0.110210 0.156896 0.166596 0.111599 0.113998 0.137420 0.137536 0.154751 0.155695 0.159532
qa: -0.2808 -0.4738 -0.2728 0.1629 0.0095 -0.0904 -0.2754 -0.2926 -0.3475 0.3584 0.0677 -0.2328 -0.3263 0.0725 -0.0574 -0.3282 -0.0262 0.1973 -0.0575 0.0627 -0.1940 -0.2101 -0.1367 -0.1345 -0.2039 0.1026 0.0911 0.0916 0.0917 0.0999 0.0982 0.0990 0.0923 0.1220 0.0932 0.0901 0.1020 0.1096 0.1161 0.0860 0.1202 0.1102 0.1569 0.1666 0.1116 0.1140 0.1374 0.1375 0.1548 0.1557 0.1595
va: 2.0978 2.0236 2.2705 3.7332 3.7629 3.8055 3.8831 3.9138 3.8812 4.1885 3.5998 3.9176 3.9801 3.8320 3.6165 3.9827 3.9235 3.6122 3.8052 3.5434 3.9469 3.8917 3.8575 3.8264 3.8633 1.0234 1.0299 1.0154 1.0011 0.9999 1.0024 0.9994 1.0019 1.0050 0.9954 1.0088 0.9940 1.0076 1.0057 0.9923 1.0128 0.9980 1.0083 1.0081 1.0111 1.0088 1.0074 1.0055 0.9914 0.9905 0.9900
dispcorr: -0.029738866 hartree
energy: -1079.778307806078
dipole: -10.92308 11.28928 0.36620 -16.12528 15.56607 -0.55920 -2.40976 1.04294 -1.36682
magnitude: 1.52151 au
magnitude: 3.86738 debye
