program: Orca
programVersion: 5.0.2
elementType: O O O C C C C C C C C C C C C C C C C C C C C C C H H H H H H H H H H H H H H H H H H H H H H H H H H
charge: 0
multiplicity: 1
keywords: wb97x-d3
keywords: def2-TZVPP
keywords: def2/J RIJCOSX
keywords: DEFGRID2
keywords: scfconv7
keywords: smallprint printgap noloewdin
keywords: NOSOSCF
formula: C22H26O3
InChI: InChI=1/C22H26O3/c1-15(2)10-19-20(22(19,3)4)21(23)25-14-17-12-18(24-13-17)11-16-8-6-5-7-9-16/h5-10,12-13,19-20H,11,14H2,1-4H3
51 atoms
O  -1.132458 1.346251 1.48651
O  -0.976739 -0.884539 1.52993
O  2.590574 2.266408 -0.825096
C  -3.500709 -0.529688 -0.360517
C  -3.872217 -1.102566 0.974749
C  -3.036324 0.160138 0.911425
C  -2.519353 -1.290519 -1.218116
C  -4.5299 0.216591 -1.174177
C  -5.239212 -1.045884 1.525979
C  -1.623704 0.1182 1.335451
C  -5.868679 -2.02101 2.190658
C  -7.26014 -1.818644 2.712363
C  -5.287792 -3.368937 2.493251
C  0.245324 1.491572 1.866723
C  1.142486 1.515726 0.680813
C  1.426712 0.470383 -0.260299
C  1.878986 2.576874 0.277115
C  2.305086 0.984741 -1.152526
C  2.989408 0.414142 -2.341979
C  4.468483 0.216215 -2.112208
C  5.370277 1.251597 -2.342245
C  4.949978 -0.999545 -1.635214
C  6.726024 1.074541 -2.101218
C  6.305327 -1.180692 -1.39688
C  7.197884 -0.142698 -1.628775
H  -3.300512 -1.984653 1.24137
H  -3.543986 1.094127 1.128195
H  -3.062075 -1.949258 -1.899149
H  -1.922045 -0.609766 -1.828639
H  -1.836244 -1.913443 -0.643973
H  -5.159787 -0.481058 -1.729961
H  -5.183721 0.842292 -0.568019
H  -4.039302 0.867847 -1.900357
H  -5.774785 -0.111807 1.3822
H  -7.95388 -2.538989 2.270253
H  -7.639018 -0.817663 2.505873
H  -7.301093 -1.977805 3.793508
H  -4.331225 -3.559339 2.012551
H  -5.973615 -4.15984 2.181872
H  -5.146502 -3.493765 3.569685
H  0.528689 0.708608 2.571346
H  0.296841 2.444587 2.392044
H  1.032941 -0.53296 -0.272349
H  1.992598 3.577059 0.66673
H  2.830445 1.062726 -3.208194
H  2.514567 -0.540484 -2.571913
H  5.013244 2.202599 -2.72002
H  4.258487 -1.814035 -1.452235
H  7.415659 1.888474 -2.286184
H  6.664456 -2.134626 -1.031729
H  8.255583 -0.282834 -1.445417
elementType: O C H
totalener: -1079.75519523 hartree
nucrepener: 2040.11554146 hartree
electener: -3119.87073669 hartree
oneelecener: -5519.43497588 hartree
twoeener: 2399.56423919 hartree
cpcmener: -0.02522114 hartree
kineticenergy: 1074.85928518 hartree
xcener: -106.461112824999 hartree
chargesum: -0.0000000
charge: -0.280401 -0.475589 -0.280328 0.108659 0.031477 -0.092300 -0.279977 -0.274255 -0.273617 0.408245 -0.048018 -0.219092 -0.254622 0.070751 -0.079919 -0.311126 -0.038514 0.203756 -0.061802 0.064863 -0.197920 -0.204276 -0.156765 -0.148520 -0.173870 0.089610 0.089779 0.098624 0.096880 0.091233 0.097804 0.087677 0.097430 0.115805 0.093635 0.087971 0.091815 0.090961 0.092886 0.098439 0.119145 0.115106 0.162273 0.173630 0.116112 0.108802 0.138097 0.140322 0.156108 0.155867 0.157151
qa: -0.2804 -0.4756 -0.2803 0.1087 0.0315 -0.0923 -0.2800 -0.2743 -0.2736 0.4082 -0.0480 -0.2191 -0.2546 0.0708 -0.0799 -0.3111 -0.0385 0.2038 -0.0618 0.0649 -0.1979 -0.2043 -0.1568 -0.1485 -0.1739 0.0896 0.0898 0.0986 0.0969 0.0912 0.0978 0.0877 0.0974 0.1158 0.0936 0.0880 0.0918 0.0910 0.0929 0.0984 0.1191 0.1151 0.1623 0.1736 0.1161 0.1088 0.1381 0.1403 0.1561 0.1559 0.1572
va: 2.1229 2.0274 2.2818 3.6943 3.7782 3.8296 3.9036 3.9063 3.8801 4.1765 3.7666 3.9214 3.9418 3.8525 3.6862 4.0081 3.9719 3.6643 3.8210 3.5726 3.9585 3.9473 3.9003 3.8914 3.9028 1.0344 1.0345 1.0017 1.0003 1.0167 1.0014 1.0069 1.0014 1.0120 0.9963 1.0090 0.9960 1.0101 0.9978 0.9959 1.0079 0.9985 1.0167 0.9944 1.0047 1.0100 1.0100 1.0041 0.9911 0.9911 0.9905
dispcorr: -0.022072934 hartree
energy: -1079.777268168709
dipole: -29.65831 29.03911 -0.61920 -12.80195 13.22285 0.42089 1.75786 -2.04684 -0.28898
magnitude: 0.80254 au
magnitude: 2.03990 debye
