program: Orca
programVersion: 5.0.2
elementType: O O O C C C C C C C C C C C C C C C C C C C C C C H H H H H H H H H H H H H H H H H H H H H H H H H H
charge: 0
multiplicity: 1
keywords: wb97x-d3
keywords: def2-TZVPP
keywords: def2/J RIJCOSX
keywords: DEFGRID2
keywords: scfconv7
keywords: smallprint printgap noloewdin
keywords: NOSOSCF
formula: C22H26O3
InChI: InChI=1/C22H26O3/c1-15(2)10-19-20(22(19,3)4)21(23)25-14-17-12-18(24-13-17)11-16-8-6-5-7-9-16/h5-10,12-13,19-20H,11,14H2,1-4H3
51 atoms
O  -1.428713 1.718043 0.73745
O  -2.334227 0.906502 -1.138968
O  1.926529 -0.445844 -0.5805
C  -4.761215 0.235569 0.738219
C  -3.89864 -0.9830 0.61984
C  -3.271705 0.352285 0.998561
C  -5.375543 0.799093 -0.519422
C  -5.645588 0.410471 1.949719
C  -3.907923 -2.080088 1.603792
C  -2.332694 0.998005 0.064867
C  -3.833737 -3.379779 1.301713
C  -3.865687 -4.424759 2.374258
C  -3.725899 -3.889651 -0.112025
C  -0.385478 2.344301 -0.003467
C  0.66329 1.370074 -0.416558
C  1.717127 1.614339 -1.352715
C  0.84519 0.102571 0.020871
C  2.453304 0.478613 -1.410949
C  3.702993 0.127926 -2.138258
C  4.934052 0.409254 -1.307937
C  5.290646 -0.427662 -0.252669
C  5.713722 1.532469 -1.564713
C  6.40053 -0.143158 0.530184
C  6.827169 1.81757 -0.785048
C  7.172735 0.981149 0.266714
H  -3.702992 -1.281667 -0.405226
H  -3.002806 0.464274 2.043107
H  -4.794668 0.587741 -1.413944
H  -6.366908 0.364757 -0.664797
H  -5.500812 1.881625 -0.446354
H  -5.913617 1.461437 2.074903
H  -6.572748 -0.154578 1.833039
H  -5.172424 0.08439 2.875212
H  -3.978789 -1.798037 2.649849
H  -3.942469 -3.991488 3.371742
H  -2.967724 -5.048042 2.344769
H  -4.713178 -5.101994 2.235379
H  -3.62364 -4.974652 -0.133476
H  -2.861725 -3.475577 -0.635297
H  -4.607928 -3.640431 -0.705761
H  0.031362 3.090783 0.674256
H  -0.782149 2.880208 -0.86862
H  1.899119 2.522758 -1.90612
H  0.307192 -0.527713 0.711952
H  3.739381 0.711784 -3.058657
H  3.677384 -0.924417 -2.432591
H  4.698824 -1.310573 -0.040639
H  5.449393 2.190876 -2.384188
H  6.664504 -0.80274 1.347331
H  7.425458 2.693719 -1.001389
H  8.039338 1.201503 0.876947
elementType: O C H
totalener: -1079.75199782 hartree
nucrepener: 2043.04631027 hartree
electener: -3122.79830809 hartree
oneelecener: -5525.35301100 hartree
twoeener: 2402.55470291 hartree
cpcmener: -0.02667360 hartree
kineticenergy: 1074.85353105 hartree
xcener: -106.460995242749 hartree
chargesum: 0.0000000
charge: -0.293689 -0.465695 -0.280984 0.101633 0.051017 -0.091138 -0.277562 -0.272457 -0.302275 0.374818 -0.009894 -0.222232 -0.284827 0.111860 -0.035966 -0.345216 -0.058241 0.223081 -0.070436 0.041528 -0.199020 -0.188673 -0.154345 -0.149508 -0.174440 0.094587 0.087057 0.092616 0.094518 0.097039 0.096896 0.097014 0.088298 0.114796 0.084052 0.095958 0.097386 0.094865 0.101637 0.105648 0.121182 0.113191 0.161126 0.167534 0.104335 0.116162 0.138352 0.139143 0.156080 0.156001 0.157187
qa: -0.2937 -0.4657 -0.2810 0.1016 0.0510 -0.0911 -0.2776 -0.2725 -0.3023 0.3748 -0.0099 -0.2222 -0.2848 0.1119 -0.0360 -0.3452 -0.0582 0.2231 -0.0704 0.0415 -0.1990 -0.1887 -0.1543 -0.1495 -0.1744 0.0946 0.0871 0.0926 0.0945 0.0970 0.0969 0.0970 0.0883 0.1148 0.0841 0.0960 0.0974 0.0949 0.1016 0.1056 0.1212 0.1132 0.1611 0.1675 0.1043 0.1162 0.1384 0.1391 0.1561 0.1560 0.1572
va: 2.1162 2.0319 2.2726 3.7138 3.7681 3.8422 3.9015 3.9136 3.9074 4.1752 3.6941 3.9204 3.9403 3.8169 3.6350 4.0020 3.9519 3.6071 3.8173 3.6174 3.9556 3.9380 3.9041 3.8924 3.9026 1.0262 1.0370 1.0210 1.0000 0.9998 1.0018 1.0014 1.0065 1.0116 1.0105 0.9931 0.9926 1.0046 0.9974 0.9952 0.9909 1.0112 1.0057 0.9992 1.0109 1.0099 1.0134 1.0038 0.9913 0.9910 0.9906
dispcorr: -0.021833567 hartree
energy: -1079.773831386247
dipole: -24.99204 24.91981 -0.07223 -12.12328 12.27781 0.15453 6.60231 -5.97604 0.62627
magnitude: 0.64908 au
magnitude: 1.64984 debye
