program: Orca
programVersion: 5.0.2
elementType: O O O C C C C C C C C C C C C C C C C C C C C C C H H H H H H H H H H H H H H H H H H H H H H H H H H
charge: 0
multiplicity: 1
keywords: wb97x-d3
keywords: def2-TZVPP
keywords: def2/J RIJCOSX
keywords: DEFGRID2
keywords: scfconv7
keywords: smallprint printgap noloewdin
keywords: NOSOSCF
formula: C22H26O3
InChI: InChI=1/C22H26O3/c1-15(2)10-19-20(22(19,3)4)21(23)25-14-17-12-18(24-13-17)11-16-8-6-5-7-9-16/h5-10,12-13,19-20H,11,14H2,1-4H3
51 atoms
O  -1.317807 2.017051 0.947534
O  -2.172426 1.429208 -1.032791
O  2.104292 2.244797 -1.823892
C  -4.015462 -0.272709 0.923243
C  -3.08165 -1.144282 0.135298
C  -2.529431 0.044223 0.886447
C  -4.999183 0.590937 0.174402
C  -4.550362 -0.774634 2.241048
C  -2.716821 -2.510113 0.572942
C  -2.007824 1.209504 0.144385
C  -2.984426 -3.643021 -0.084157
C  -2.550762 -4.970163 0.462305
C  -3.726455 -3.714425 -1.38362
C  -0.683014 3.166633 0.362304
C  0.600726 2.801055 -0.292967
C  1.861296 2.577436 0.347836
C  0.816728 2.580533 -1.611368
C  2.739375 2.243752 -0.627087
C  4.17718 1.860435 -0.604877
C  4.388087 0.392536 -0.311646
C  5.036399 -0.007409 0.852178
C  3.930071 -0.585661 -1.192816
C  5.225231 -1.354924 1.133949
C  4.114864 -1.931357 -0.91274
C  4.763639 -2.321269 0.252734
H  -3.145423 -0.998046 -0.938077
H  -2.001237 -0.170196 1.80994
H  -4.646061 0.888844 -0.810651
H  -5.933565 0.043927 0.031649
H  -5.234438 1.497549 0.736461
H  -4.857576 0.059529 2.875129
H  -5.426359 -1.406675 2.080167
H  -3.819685 -1.359651 2.7992
H  -2.184029 -2.586942 1.516702
H  -1.900631 -5.493381 -0.244425
H  -3.409304 -5.625299 0.633058
H  -2.010492 -4.872081 1.404033
H  -4.619781 -4.335714 -1.277305
H  -3.114547 -4.189025 -2.155601
H  -4.04677 -2.745187 -1.761344
H  -0.508175 3.838625 1.201503
H  -1.35886 3.667827 -0.331745
H  2.080386 2.659811 1.401409
H  0.179464 2.635127 -2.479969
H  4.683389 2.456971 0.155336
H  4.637734 2.121219 -1.561282
H  5.398607 0.741404 1.546999
H  3.42609 -0.296797 -2.107836
H  5.733127 -1.647156 2.044454
H  3.753237 -2.678917 -1.6074
H  4.90878 -3.371776 0.470317
elementType: O C H
totalener: -1079.75376980 hartree
nucrepener: 2079.01848793 hartree
electener: -3158.77225773 hartree
oneelecener: -5597.54080073 hartree
twoeener: 2438.76854300 hartree
cpcmener: -0.02500864 hartree
kineticenergy: 1074.85755790 hartree
xcener: -106.459059574286 hartree
chargesum: -0.0000000
charge: -0.283673 -0.476326 -0.275086 0.126138 0.024100 -0.125922 -0.281142 -0.262726 -0.275945 0.408530 -0.036818 -0.223071 -0.251637 0.087978 -0.087929 -0.329589 -0.010934 0.222212 -0.060424 0.016569 -0.182657 -0.193091 -0.150510 -0.153356 -0.174401 0.089630 0.088749 0.091470 0.095064 0.098123 0.097663 0.095733 0.088215 0.118097 0.093561 0.092638 0.088029 0.094782 0.095889 0.088772 0.120762 0.117816 0.159929 0.170343 0.102727 0.113992 0.138598 0.138528 0.156713 0.156916 0.156972
qa: -0.2837 -0.4763 -0.2751 0.1261 0.0241 -0.1259 -0.2811 -0.2627 -0.2759 0.4085 -0.0368 -0.2231 -0.2516 0.0880 -0.0879 -0.3296 -0.0109 0.2222 -0.0604 0.0166 -0.1827 -0.1931 -0.1505 -0.1534 -0.1744 0.0896 0.0887 0.0915 0.0951 0.0981 0.0977 0.0957 0.0882 0.1181 0.0936 0.0926 0.0880 0.0948 0.0959 0.0888 0.1208 0.1178 0.1599 0.1703 0.1027 0.1140 0.1386 0.1385 0.1567 0.1569 0.1570
va: 2.1230 2.0289 2.2790 3.6914 3.7619 3.8789 3.9033 3.9046 3.8742 4.1822 3.7340 3.9242 3.9445 3.8150 3.6319 3.9951 3.9399 3.5962 3.8029 3.6617 3.9305 3.9414 3.8939 3.9036 3.9028 1.0348 1.0379 1.0192 1.0009 0.9998 1.0028 1.0030 1.0041 1.0093 0.9958 0.9964 1.0086 0.9973 0.9973 1.0091 0.9938 1.0120 1.0077 1.0039 1.0096 1.0096 1.0040 1.0152 0.9911 0.9914 0.9909
dispcorr: -0.021933059 hartree
energy: -1079.775702862525
dipole: -21.98630 22.07702 0.09072 -19.80920 19.66296 -0.14624 5.60398 -4.59116 1.01282
magnitude: 1.02733 au
magnitude: 2.61128 debye
