program: Orca
programVersion: 5.0.2
elementType: O O O C C C C C C C C C C C C C C C C C C C C C C H H H H H H H H H H H H H H H H H H H H H H H H H H
charge: 0
multiplicity: 1
keywords: wb97x-d3
keywords: def2-TZVPP
keywords: def2/J RIJCOSX
keywords: DEFGRID2
keywords: scfconv7
keywords: smallprint printgap noloewdin
keywords: NOSOSCF
formula: C22H26O3
InChI: InChI=1/C22H26O3/c1-15(2)10-19-20(22(19,3)4)21(23)25-14-17-12-18(24-13-17)11-16-8-6-5-7-9-16/h5-10,12-13,19-20H,11,14H2,1-4H3
51 atoms
O  -0.895763 1.38135 1.235276
O  -2.217104 1.647066 -0.548394
O  1.879729 2.155851 -2.160999
C  -4.084717 -0.168791 1.261157
C  -3.548081 -0.942696 0.093288
C  -2.592173 -0.168881 0.96754
C  -4.920147 1.058673 0.995864
C  -4.512293 -0.922545 2.496561
C  -3.491758 -2.42482 0.091537
C  -1.91062 1.032953 0.44668
C  -4.307086 -3.229397 -0.596481
C  -4.157957 -4.719405 -0.535941
C  -5.42481 -2.741792 -1.466181
C  -0.124156 2.538408 0.875069
C  0.865962 2.238879 -0.19236
C  2.093607 1.510205 -0.056151
C  0.793967 2.596868 -1.494704
C  2.668041 1.492453 -1.282474
C  3.933781 0.922733 -1.820561
C  4.716308 0.204597 -0.756399
C  5.752299 0.844313 -0.083699
C  4.3996 -1.106374 -0.409703
C  6.461598 0.187857 0.913644
C  5.104476 -1.764571 0.587843
C  6.139213 -1.118594 1.252225
H  -3.745171 -0.480697 -0.869688
H  -1.998093 -0.751072 1.664525
H  -4.795668 1.800458 1.788038
H  -4.691547 1.539144 0.046688
H  -5.97656 0.782797 0.971645
H  -5.522998 -1.318004 2.37257
H  -3.85706 -1.7624 2.726482
H  -4.520562 -0.262888 3.366655
H  -2.723946 -2.883475 0.708545
H  -3.334248 -5.026527 0.108715
H  -3.980161 -5.138144 -1.530353
H  -5.071306 -5.19117 -0.163148
H  -5.300846 -3.091098 -2.494786
H  -5.516722 -1.657217 -1.490351
H  -6.380678 -3.144471 -1.119973
H  0.38088 2.823239 1.797394
H  -0.779272 3.361558 0.5865
H  2.488308 1.069227 0.845809
H  0.064635 3.151279 -2.064732
H  4.541309 1.724586 -2.25089
H  3.704261 0.238016 -2.643173
H  6.009398 1.864613 -0.34376
H  3.595185 -1.617302 -0.926445
H  7.268805 0.697751 1.424138
H  4.848558 -2.785026 0.84362
H  6.692714 -1.632422 2.027801
elementType: O C H
totalener: -1079.75468936 hartree
nucrepener: 2049.34464734 hartree
electener: -3129.09933670 hartree
oneelecener: -5537.98389105 hartree
twoeener: 2408.88455435 hartree
cpcmener: -0.02444016 hartree
kineticenergy: 1074.85546342 hartree
xcener: -106.460006779882 hartree
chargesum: -0.0000000
charge: -0.284561 -0.476187 -0.279975 0.143985 -0.002330 -0.131184 -0.293359 -0.264184 -0.264401 0.413175 -0.033420 -0.229087 -0.250477 0.087546 -0.103538 -0.296722 -0.016944 0.173429 -0.000758 -0.002076 -0.183218 -0.194378 -0.155410 -0.153437 -0.164717 0.094610 0.087891 0.100684 0.093279 0.094795 0.095643 0.089417 0.097641 0.119827 0.088762 0.094460 0.093081 0.097157 0.087658 0.095128 0.121812 0.117853 0.159868 0.171960 0.103061 0.108403 0.138258 0.141161 0.155925 0.156158 0.157738
qa: -0.2846 -0.4762 -0.2800 0.1440 -0.0023 -0.1312 -0.2934 -0.2642 -0.2644 0.4132 -0.0334 -0.2291 -0.2505 0.0875 -0.1035 -0.2967 -0.0169 0.1734 -0.0008 -0.0021 -0.1832 -0.1944 -0.1554 -0.1534 -0.1647 0.0946 0.0879 0.1007 0.0933 0.0948 0.0956 0.0894 0.0976 0.1198 0.0888 0.0945 0.0931 0.0972 0.0877 0.0951 0.1218 0.1179 0.1599 0.1720 0.1031 0.1084 0.1383 0.1412 0.1559 0.1562 0.1577
va: 2.1209 2.0316 2.2770 3.6747 3.7737 3.8860 3.9030 3.9060 3.8718 4.1810 3.7100 3.9272 3.9431 3.8244 3.6688 3.9841 3.9584 3.6848 3.8154 3.6306 3.9306 3.9286 3.8988 3.8957 3.8921 1.0282 1.0386 0.9990 1.0185 1.0012 1.0031 1.0031 1.0028 1.0078 1.0081 0.9955 0.9963 0.9980 1.0088 0.9973 0.9920 1.0102 1.0038 1.0020 1.0083 1.0047 1.0045 1.0035 0.9913 0.9912 0.9903
dispcorr: -0.022127089 hartree
energy: -1079.776816445464
dipole: -26.68797 26.80695 0.11899 -17.16169 16.60765 -0.55404 5.22256 -4.38497 0.83759
magnitude: 1.01127 au
magnitude: 2.57045 debye
