program: Orca
programVersion: 5.0.2
elementType: O O O C C C C C C C C C C C C C C C C C C C C C C H H H H H H H H H H H H H H H H H H H H H H H H H H
charge: 0
multiplicity: 1
keywords: wb97x-d3
keywords: def2-TZVPP
keywords: def2/J RIJCOSX
keywords: DEFGRID2
keywords: scfconv7
keywords: smallprint printgap noloewdin
keywords: NOSOSCF
formula: C22H26O3
InChI: InChI=1/C22H26O3/c1-15(2)10-19-20(22(19,3)4)21(23)25-14-17-12-18(24-13-17)11-16-8-6-5-7-9-16/h5-10,12-13,19-20H,11,14H2,1-4H3
51 atoms
O  -1.841894 2.224876 -0.264827
O  -1.341708 1.485586 1.78603
O  2.477585 2.636783 0.303662
C  -1.33777 -1.186039 0.042551
C  -2.415566 -1.194136 1.090282
C  -2.289044 -0.00527 0.172759
C  0.098009 -1.066418 0.493676
C  -1.492094 -2.031322 -1.197718
C  -3.612419 -2.056278 0.995022
C  -1.784418 1.285797 0.679877
C  -4.041993 -2.915867 1.924436
C  -5.294154 -3.712584 1.715404
C  -3.352793 -3.165932 3.232251
C  -1.076873 3.424532 -0.054579
C  0.369741 3.112128 -0.191149
C  1.030591 2.63383 -1.369276
C  1.301614 3.084503 0.788871
C  2.305126 2.355154 -1.009727
C  3.44197 1.720611 -1.728921
C  3.430848 0.222341 -1.528303
C  2.852007 -0.610779 -2.481276
C  3.939816 -0.345449 -0.362968
C  2.782309 -1.982507 -2.277208
C  3.870533 -1.716344 -0.155939
C  3.290665 -2.539795 -1.11231
H  -2.046693 -1.017681 2.095241
H  -3.014783 0.074721 -0.630361
H  0.213007 -0.518721 1.427215
H  0.515473 -2.063048 0.650511
H  0.709119 -0.570459 -0.264453
H  -2.517942 -2.0705 -1.562634
H  -0.870302 -1.63951 -2.005618
H  -1.170201 -3.056933 -1.00381
H  -4.195222 -1.966078 0.08242
H  -6.010697 -3.537645 2.522927
H  -5.083509 -4.785686 1.719007
H  -5.786335 -3.47053 0.773133
H  -3.224074 -4.238725 3.398197
H  -3.956008 -2.796722 4.067005
H  -2.369463 -2.704486 3.304776
H  -1.305249 3.87681 0.911655
H  -1.417401 4.105114 -0.833699
H  0.602681 2.50007 -2.350961
H  1.275405 3.347818 1.834813
H  4.388081 2.145491 -1.385001
H  3.355754 1.954132 -2.790829
H  2.44966 -0.183388 -3.392566
H  4.396807 0.286243 0.390015
H  2.330908 -2.615575 -3.030816
H  4.272199 -2.142691 0.754692
H  3.236908 -3.608875 -0.950817
elementType: O C H
totalener: -1079.75278197 hartree
nucrepener: 2189.47870328 hartree
electener: -3269.23148525 hartree
oneelecener: -5818.52913710 hartree
twoeener: 2549.29765185 hartree
cpcmener: -0.02561810 hartree
kineticenergy: 1074.85914383 hartree
xcener: -106.461631067084 hartree
chargesum: -0.0000000
charge: -0.282615 -0.457785 -0.273739 0.175767 0.025957 -0.103407 -0.279505 -0.280174 -0.286175 0.362195 -0.034568 -0.222928 -0.258520 0.091190 -0.055874 -0.350395 -0.028544 0.214583 -0.062116 0.042263 -0.174172 -0.188985 -0.161498 -0.152052 -0.176389 0.089490 0.090768 0.100286 0.105335 0.049397 0.090936 0.093755 0.097623 0.116341 0.092477 0.093350 0.088056 0.092340 0.099456 0.092106 0.115775 0.120385 0.156726 0.171511 0.113767 0.106392 0.136309 0.137547 0.156126 0.154962 0.156269
qa: -0.2826 -0.4578 -0.2737 0.1758 0.0260 -0.1034 -0.2795 -0.2802 -0.2862 0.3622 -0.0346 -0.2229 -0.2585 0.0912 -0.0559 -0.3504 -0.0285 0.2146 -0.0621 0.0423 -0.1742 -0.1890 -0.1615 -0.1521 -0.1764 0.0895 0.0908 0.1003 0.1053 0.0494 0.0909 0.0938 0.0976 0.1163 0.0925 0.0934 0.0881 0.0923 0.0995 0.0921 0.1158 0.1204 0.1567 0.1715 0.1138 0.1064 0.1363 0.1375 0.1561 0.1550 0.1563
va: 2.1072 2.0477 2.2713 3.6274 3.7956 3.8365 3.9074 3.9049 3.8823 4.2503 3.7397 3.9249 3.9439 3.8429 3.6303 3.9702 3.9535 3.6012 3.8182 3.6033 3.8871 3.9303 3.8600 3.8841 3.8644 1.0337 1.0362 1.0236 0.9994 1.0103 1.0071 1.0036 1.0019 1.0104 0.9952 0.9965 1.0088 0.9983 0.9958 1.0078 1.0086 0.9918 1.0112 0.9996 1.0119 1.0118 1.0046 1.0115 0.9914 0.9917 0.9917
dispcorr: -0.026946754 hartree
energy: -1079.779728723713
dipole: -14.11624 14.09042 -0.02582 -22.80925 22.45569 -0.35356 3.17124 -4.27245 -1.10120
magnitude: 1.15686 au
magnitude: 2.94050 debye
