program: Orca
programVersion: 5.0.2
elementType: O O O C C C C C C C C C C C C C C C C C C C C C C H H H H H H H H H H H H H H H H H H H H H H H H H H
charge: 0
multiplicity: 1
keywords: wb97x-d3
keywords: def2-TZVPP
keywords: def2/J RIJCOSX
keywords: DEFGRID2
keywords: scfconv7
keywords: smallprint printgap noloewdin
keywords: NOSOSCF
formula: C22H26O3
InChI: InChI=1/C22H26O3/c1-15(2)10-19-20(22(19,3)4)21(23)25-14-17-12-18(24-13-17)11-16-8-6-5-7-9-16/h5-10,12-13,19-20H,11,14H2,1-4H3
51 atoms
O  -1.190406 1.37964 1.255502
O  -0.939075 -0.830677 1.486724
O  2.444493 2.227161 -1.191675
C  -3.549412 -0.843593 -0.272646
C  -3.867301 -1.165089 1.156307
C  -3.054114 0.074174 0.833039
C  -2.58474 -1.737575 -1.013389
C  -4.624856 -0.275079 -1.168245
C  -5.215203 -1.008579 1.735504
C  -1.631871 0.124389 1.221027
C  -5.823406 -1.851572 2.576739
C  -7.19529 -1.550496 3.102255
C  -5.233697 -3.132474 3.084109
C  0.181647 1.616456 1.611503
C  1.07499 1.562789 0.42421
C  1.45756 0.426656 -0.364367
C  1.706441 2.621292 -0.134863
C  2.284813 0.890016 -1.329813
C  3.035357 0.221313 -2.423898
C  4.52355 0.224784 -2.169076
C  5.107431 -0.78159 -1.404401
C  5.328931 1.248207 -2.658715
C  6.469256 -0.76914 -1.13852
C  6.691819 1.265033 -2.391818
C  7.266072 0.256327 -1.630683
H  -3.274428 -1.976927 1.563066
H  -3.573524 1.024002 0.899389
H  -3.141439 -2.501501 -1.56015
H  -2.005433 -1.169673 -1.745134
H  -1.885901 -2.25388 -0.359146
H  -5.25831 -1.074675 -1.558423
H  -5.270322 0.440822 -0.661077
H  -4.178834 0.238038 -2.022493
H  -5.753191 -0.107583 1.455134
H  -7.20348 -1.536718 4.195638
H  -7.909805 -2.320956 2.799841
H  -7.571234 -0.588929 2.752519
H  -4.312561 -3.424189 2.585028
H  -5.943846 -3.95401 2.967377
H  -5.021966 -3.062221 4.154014
H  0.498254 0.915537 2.385056
H  0.193265 2.616171 2.044222
H  1.161625 -0.600637 -0.226602
H  1.72458 3.672529 0.109171
H  2.818355 0.707435 -3.37923
H  2.66914 -0.803465 -2.500603
H  4.49113 -1.584241 -1.015395
H  4.890068 2.036511 -3.259266
H  6.90919 -1.562173 -0.547018
H  7.305868 2.067291 -2.781343
H  8.328617 0.267412 -1.423895
elementType: O C H
totalener: -1079.75526732 hartree
nucrepener: 2035.61499116 hartree
electener: -3115.37025849 hartree
oneelecener: -5510.48623843 hartree
twoeener: 2395.11597995 hartree
cpcmener: -0.02501142 hartree
kineticenergy: 1074.86103087 hartree
xcener: -106.461258813779 hartree
chargesum: -0.0000000
charge: -0.281843 -0.478850 -0.279481 0.100533 0.043059 -0.092363 -0.279188 -0.270672 -0.278908 0.411688 -0.044706 -0.217453 -0.257416 0.072024 -0.085797 -0.305985 -0.036545 0.199414 -0.061471 0.060711 -0.202549 -0.195397 -0.152684 -0.157156 -0.173650 0.089694 0.088235 0.096462 0.096876 0.092845 0.097110 0.088044 0.096890 0.115846 0.091942 0.093211 0.086665 0.091991 0.092588 0.099444 0.118782 0.114822 0.161398 0.174023 0.114460 0.111099 0.141794 0.139253 0.157080 0.156561 0.157569
qa: -0.2818 -0.4788 -0.2795 0.1005 0.0431 -0.0924 -0.2792 -0.2707 -0.2789 0.4117 -0.0447 -0.2175 -0.2574 0.0720 -0.0858 -0.3060 -0.0365 0.1994 -0.0615 0.0607 -0.2025 -0.1954 -0.1527 -0.1572 -0.1736 0.0897 0.0882 0.0965 0.0969 0.0928 0.0971 0.0880 0.0969 0.1158 0.0919 0.0932 0.0867 0.0920 0.0926 0.0994 0.1188 0.1148 0.1614 0.1740 0.1145 0.1111 0.1418 0.1393 0.1571 0.1566 0.1576
va: 2.1236 2.0244 2.2818 3.6990 3.7658 3.8407 3.9029 3.9076 3.8827 4.1584 3.7618 3.9226 3.9421 3.8543 3.6842 4.0088 3.9709 3.6652 3.8205 3.5734 3.9460 3.9581 3.8963 3.8997 3.9022 1.0342 1.0353 1.0011 1.0002 1.0182 1.0016 1.0069 1.0017 1.0117 0.9959 0.9964 1.0094 1.0090 0.9980 0.9957 1.0080 0.9987 1.0183 0.9943 1.0055 1.0093 1.0036 1.0076 0.9908 0.9909 0.9905
dispcorr: -0.021890246 hartree
energy: -1079.777157568241
dipole: -29.49463 28.84695 -0.64769 -13.50456 13.85228 0.34771 4.48981 -4.72162 -0.23181
magnitude: 0.77080 au
magnitude: 1.95923 debye
