program: Orca
programVersion: 5.0.2
elementType: O O O C C C C C C C C C C C C C C C C C C C C C C H H H H H H H H H H H H H H H H H H H H H H H H H H
charge: 0
multiplicity: 1
keywords: wb97x-d3
keywords: def2-TZVPP
keywords: def2/J RIJCOSX
keywords: DEFGRID2
keywords: scfconv7
keywords: smallprint printgap noloewdin
keywords: NOSOSCF
formula: C22H26O3
InChI: InChI=1/C22H26O3/c1-15(2)10-19-20(22(19,3)4)21(23)25-14-17-12-18(24-13-17)11-16-8-6-5-7-9-16/h5-10,12-13,19-20H,11,14H2,1-4H3
51 atoms
O  -1.470475 1.462187 -0.310029
O  -1.427615 1.015798 1.879132
O  2.791623 1.794154 0.627987
C  -2.166024 -1.875391 0.892921
C  -3.376119 -1.184277 1.416282
C  -2.518581 -0.487774 0.372845
C  -0.982143 -2.078216 1.806238
C  -2.335375 -2.992688 -0.108167
C  -4.756262 -1.62049 1.081981
C  -1.755695 0.713348 0.754436
C  -5.823922 -0.818386 1.05685
C  -7.189946 -1.345142 0.739885
C  -5.756369 0.651986 1.332472
C  -0.696174 2.654467 -0.099218
C  0.761811 2.357079 -0.067864
C  1.654723 2.336807 -1.187697
C  1.516823 2.018683 1.005279
C  2.872754 1.993288 -0.708493
C  4.188693 1.770335 -1.36033
C  4.515464 0.302076 -1.500058
C  5.400547 -0.322416 -0.62832
C  3.912034 -0.454274 -2.502207
C  5.685084 -1.676425 -0.75907
C  4.194526 -1.805297 -2.636096
C  5.084182 -2.420747 -1.763865
H  -3.256321 -0.767777 2.413586
H  -2.911513 -0.469799 -0.637457
H  -0.04469 -2.068006 1.245853
H  -0.911976 -1.329501 2.59242
H  -1.061687 -3.052659 2.293599
H  -2.535782 -3.938755 0.399759
H  -3.150207 -2.812169 -0.809388
H  -1.422261 -3.12205 -0.692519
H  -4.900204 -2.676532 0.870519
H  -7.612378 -0.839235 -0.13266
H  -7.883308 -1.164444 1.565666
H  -7.181827 -2.416067 0.536086
H  -6.410602 0.919637 2.166559
H  -6.112697 1.221945 0.469901
H  -4.753445 1.002482 1.57134
H  -1.024063 3.168195 0.804841
H  -0.933926 3.292249 -0.949168
H  1.412717 2.557839 -2.215995
H  1.297187 1.911532 2.055782
H  4.976841 2.276352 -0.796934
H  4.155843 2.238892 -2.345485
H  5.877468 0.254057 0.155769
H  3.217471 0.02031 -3.186345
H  6.379528 -2.148391 -0.075448
H  3.723104 -2.378394 -3.424598
H  5.308669 -3.474498 -1.869749
elementType: O C H
totalener: -1079.75330487 hartree
nucrepener: 2083.52780157 hartree
electener: -3163.28110645 hartree
oneelecener: -5606.48453875 hartree
twoeener: 2443.20343231 hartree
cpcmener: -0.02395893 hartree
kineticenergy: 1074.85991656 hartree
xcener: -106.459430194624 hartree
chargesum: -0.0000000
charge: -0.286803 -0.482007 -0.276356 0.154267 -0.034453 -0.094060 -0.277474 -0.291270 -0.283491 0.394314 -0.012939 -0.227395 -0.244069 0.091420 -0.087020 -0.329971 -0.015238 0.205485 -0.066870 0.050557 -0.195732 -0.194376 -0.153179 -0.158794 -0.171720 0.101707 0.090802 0.098876 0.092932 0.094493 0.098371 0.092298 0.098101 0.121497 0.093540 0.094885 0.088871 0.099713 0.097203 0.080546 0.119409 0.117203 0.160531 0.167989 0.109592 0.116630 0.139458 0.141655 0.156544 0.156916 0.157411
qa: -0.2868 -0.4820 -0.2764 0.1543 -0.0345 -0.0941 -0.2775 -0.2913 -0.2835 0.3943 -0.0129 -0.2274 -0.2441 0.0914 -0.0870 -0.3300 -0.0152 0.2055 -0.0669 0.0506 -0.1957 -0.1944 -0.1532 -0.1588 -0.1717 0.1017 0.0908 0.0989 0.0929 0.0945 0.0984 0.0923 0.0981 0.1215 0.0935 0.0949 0.0889 0.0997 0.0972 0.0805 0.1194 0.1172 0.1605 0.1680 0.1096 0.1166 0.1395 0.1417 0.1565 0.1569 0.1574
va: 2.1206 2.0171 2.2833 3.7041 3.8292 3.8138 3.8865 3.9110 3.8824 4.1522 3.7066 3.9303 3.9399 3.8058 3.6396 4.0245 3.9454 3.6276 3.8205 3.5861 3.9600 3.9442 3.8959 3.9085 3.9013 1.0264 1.0321 0.9993 1.0188 1.0015 0.9996 1.0015 1.0029 1.0033 0.9965 0.9962 1.0066 0.9992 0.9983 1.0155 1.0122 0.9958 1.0066 1.0075 1.0103 1.0066 1.0053 1.0037 0.9910 0.9913 0.9906
dispcorr: -0.022639447 hartree
energy: -1079.775944321015
dipole: -24.27690 23.93733 -0.33957 -13.09510 13.09064 -0.00446 1.71258 -2.84932 -1.13674
magnitude: 1.18639 au
magnitude: 3.01555 debye
