program: Orca
programVersion: 5.0.2
elementType: O O O C C C C C C C C C C C C C C C C C C C C C C H H H H H H H H H H H H H H H H H H H H H H H H H H
charge: 0
multiplicity: 1
keywords: wb97x-d3
keywords: def2-TZVPP
keywords: def2/J RIJCOSX
keywords: DEFGRID2
keywords: scfconv7
keywords: smallprint printgap noloewdin
keywords: NOSOSCF
formula: C22H26O3
InChI: InChI=1/C22H26O3/c1-15(2)10-19-20(22(19,3)4)21(23)25-14-17-12-18(24-13-17)11-16-8-6-5-7-9-16/h5-10,12-13,19-20H,11,14H2,1-4H3
51 atoms
O  -1.638568 1.601972 -0.07801
O  -1.886491 -0.317694 -1.197262
O  1.923921 -0.251498 1.137101
C  -4.807979 -0.186545 -0.032085
C  -3.975282 -1.095622 0.801665
C  -3.466537 0.305337 0.491464
C  -4.995699 -0.507366 -1.494543
C  -6.012296 0.485675 0.582525
C  -4.318834 -1.469017 2.196303
C  -2.27726 0.46167 -0.36081
C  -3.440744 -1.91857 3.097494
C  -3.869315 -2.3063 4.479212
C  -1.977161 -2.068975 2.818848
C  -0.408013 1.858979 -0.749094
C  0.702282 1.03675 -0.191443
C  1.978335 0.813437 -0.80034
C  0.730968 0.370671 0.984955
C  2.677345 0.02389 0.051151
C  4.034128 -0.586565 -0.004303
C  4.875916 0.034674 -1.085418
C  4.997015 -0.568579 -2.3326
C  5.527782 1.244769 -0.859765
C  5.756624 0.021682 -3.335031
C  6.288698 1.835947 -1.857297
C  6.406116 1.224655 -3.0994
H  -3.459725 -1.866261 0.23401
H  -3.533047 1.023705 1.300753
H  -5.115213 0.402154 -2.086731
H  -4.173179 -1.078834 -1.918228
H  -5.902911 -1.101628 -1.622219
H  -6.268224 1.390312 0.027342
H  -6.881592 -0.175113 0.551354
H  -5.85097 0.775626 1.621099
H  -5.361438 -1.385833 2.489779
H  -3.624851 -3.351246 4.688356
H  -4.940805 -2.175101 4.630906
H  -3.346832 -1.711829 5.233683
H  -1.658535 -3.104147 2.967582
H  -1.390248 -1.466438 3.517726
H  -1.694681 -1.777306 1.808362
H  -0.219652 2.922974 -0.593974
H  -0.504746 1.702893 -1.826461
H  2.31682 1.192358 -1.75202
H  0.019454 0.248347 1.786819
H  3.946038 -1.664533 -0.173032
H  4.524421 -0.468096 0.966287
H  4.495004 -1.509995 -2.523427
H  5.440172 1.728029 0.106652
H  5.843032 -0.462317 -4.299596
H  6.793694 2.773935 -1.664057
H  7.002821 1.68331 -3.877463
elementType: O C H
totalener: -1079.75218207 hartree
nucrepener: 2072.59689363 hartree
electener: -3152.34907570 hartree
oneelecener: -5584.32789434 hartree
twoeener: 2431.97881864 hartree
cpcmener: -0.02517927 hartree
kineticenergy: 1074.85433390 hartree
xcener: -106.462574635991 hartree
chargesum: -0.0000000
charge: -0.292368 -0.466889 -0.285960 0.155610 -0.027900 -0.073141 -0.275688 -0.292503 -0.289005 0.350991 0.002112 -0.230144 -0.259393 0.111654 -0.057029 -0.311231 -0.067732 0.177351 -0.006179 -0.003045 -0.179120 -0.193894 -0.157125 -0.151138 -0.165430 0.101926 0.090077 0.098100 0.093277 0.094038 0.098124 0.100092 0.090736 0.122827 0.095115 0.088659 0.094278 0.104126 0.098036 0.076426 0.119373 0.113206 0.161346 0.186886 0.102312 0.107459 0.139859 0.140100 0.156197 0.156668 0.157950
qa: -0.2924 -0.4669 -0.2860 0.1556 -0.0279 -0.0731 -0.2757 -0.2925 -0.2890 0.3510 0.0021 -0.2301 -0.2594 0.1117 -0.0570 -0.3112 -0.0677 0.1774 -0.0062 -0.0030 -0.1791 -0.1939 -0.1571 -0.1511 -0.1654 0.1019 0.0901 0.0981 0.0933 0.0940 0.0981 0.1001 0.0907 0.1228 0.0951 0.0887 0.0943 0.1041 0.0980 0.0764 0.1194 0.1132 0.1613 0.1869 0.1023 0.1075 0.1399 0.1401 0.1562 0.1567 0.1579
va: 2.1155 2.0271 2.2673 3.7158 3.8209 3.7898 3.8842 3.9146 3.8948 4.1810 3.6816 3.9301 3.9489 3.8179 3.6894 3.9886 3.9497 3.6835 3.8113 3.6339 3.9226 3.9321 3.8999 3.8930 3.8925 1.0249 1.0338 0.9997 1.0195 1.0009 1.0027 0.9987 1.0013 1.0034 0.9959 1.0067 0.9966 1.0009 0.9963 1.0122 0.9915 1.0116 1.0008 0.9869 1.0050 1.0077 1.0043 1.0032 0.9912 0.9907 0.9901
dispcorr: -0.023342292 hartree
energy: -1079.775524358292
dipole: -22.38843 22.28393 -0.10450 -6.77128 7.34026 0.56898 9.06551 -8.48548 0.58003
magnitude: 0.81920 au
magnitude: 2.08225 debye
