program: Orca
programVersion: 5.0.2
elementType: O O O C C C C C C C C C C C C C C C C C C C C C C H H H H H H H H H H H H H H H H H H H H H H H H H H
charge: 0
multiplicity: 1
keywords: wb97x-d3
keywords: def2-TZVPP
keywords: def2/J RIJCOSX
keywords: DEFGRID2
keywords: scfconv7
keywords: smallprint printgap noloewdin
keywords: NOSOSCF
formula: C22H26O3
InChI: InChI=1/C22H26O3/c1-15(2)10-19-20(22(19,3)4)21(23)25-14-17-12-18(24-13-17)11-16-8-6-5-7-9-16/h5-10,12-13,19-20H,11,14H2,1-4H3
51 atoms
O  -1.219317 1.556838 0.914206
O  -2.406153 1.256247 -0.957635
O  2.087673 0.23894 -1.307344
C  -4.451425 -0.01095 1.090656
C  -3.721268 -1.084662 0.343236
C  -2.932363 0.010241 1.021442
C  -5.272317 0.988578 0.315443
C  -5.037973 -0.345826 2.439963
C  -3.615138 -2.475524 0.849681
C  -2.19497 0.989392 0.200983
C  -4.357224 -3.502192 0.425386
C  -4.163264 -4.88211 0.976315
C  -5.430639 -3.37827 -0.611967
C  -0.349057 2.483899 0.271031
C  0.77768 1.788491 -0.411738
C  1.981677 2.405024 -0.882698
C  0.902863 0.47241 -0.697997
C  2.739014 1.416337 -1.414448
C  4.114426 1.386104 -1.977842
C  5.079165 0.737715 -1.012963
C  5.232172 -0.645745 -0.981351
C  5.788476 1.51215 -0.099547
C  6.072207 -1.242371 -0.050925
C  6.632263 0.918645 0.829291
C  6.773948 -0.46226 0.858212
H  -3.776599 -0.985764 -0.737204
H  -2.433724 -0.259394 1.946483
H  -6.301233 0.631788 0.233996
H  -5.301677 1.954015 0.825408
H  -4.90601 1.154049 -0.695295
H  -6.012148 -0.825675 2.322131
H  -4.407477 -1.02196 3.016762
H  -5.185078 0.558381 3.033928
H  -2.871788 -2.661298 1.620002
H  -3.371646 -4.919483 1.724873
H  -3.908734 -5.590104 0.182966
H  -5.081721 -5.254214 1.438299
H  -5.218833 -4.018845 -1.472193
H  -5.565942 -2.361539 -0.977603
H  -6.390132 -3.713419 -0.208758
H  0.031995 3.124132 1.067275
H  -0.899798 3.124167 -0.421949
H  2.247822 3.448609 -0.81504
H  0.270333 -0.387407 -0.54078
H  4.419513 2.412887 -2.182977
H  4.119761 0.854185 -2.933024
H  4.692578 -1.263671 -1.689517
H  5.678262 2.590497 -0.113683
H  6.178348 -2.319827 -0.036266
H  7.178784 1.53564 1.531484
H  7.428276 -0.92783 1.584229
elementType: O C H
totalener: -1079.75280135 hartree
nucrepener: 2036.58953254 hartree
electener: -3116.34233389 hartree
oneelecener: -5512.38377799 hartree
twoeener: 2396.04144410 hartree
cpcmener: -0.02667621 hartree
kineticenergy: 1074.86000555 hartree
xcener: -106.461883529462 hartree
chargesum: -0.0000000
charge: -0.286171 -0.464985 -0.281662 0.145492 -0.013817 -0.118530 -0.295830 -0.265022 -0.255028 0.378251 -0.037053 -0.229147 -0.250020 0.104296 -0.022642 -0.350985 -0.054809 0.211932 -0.067784 0.069987 -0.202233 -0.206857 -0.152120 -0.147315 -0.177035 0.099328 0.091301 0.094354 0.100275 0.094187 0.095289 0.090711 0.098301 0.119929 0.088972 0.094183 0.093571 0.098619 0.087037 0.095591 0.123190 0.113093 0.159296 0.162026 0.105788 0.115724 0.138871 0.139371 0.156063 0.156472 0.157543
qa: -0.2862 -0.4650 -0.2817 0.1455 -0.0138 -0.1185 -0.2958 -0.2650 -0.2550 0.3783 -0.0371 -0.2291 -0.2500 0.1043 -0.0226 -0.3510 -0.0548 0.2119 -0.0678 0.0700 -0.2022 -0.2069 -0.1521 -0.1473 -0.1770 0.0993 0.0913 0.0944 0.1003 0.0942 0.0953 0.0907 0.0983 0.1199 0.0890 0.0942 0.0936 0.0986 0.0870 0.0956 0.1232 0.1131 0.1593 0.1620 0.1058 0.1157 0.1389 0.1394 0.1561 0.1565 0.1575
va: 2.1251 2.0346 2.2754 3.6856 3.7766 3.8795 3.9001 3.9043 3.8684 4.2036 3.7078 3.9277 3.9425 3.8325 3.6223 4.0175 3.9543 3.6256 3.8332 3.5716 3.9604 3.9503 3.8970 3.8901 3.9070 1.0259 1.0368 1.0010 0.9997 1.0189 1.0026 1.0025 1.0031 1.0075 1.0078 0.9954 0.9962 0.9984 1.0086 0.9975 0.9921 1.0114 1.0066 0.9988 1.0110 1.0062 1.0106 1.0043 0.9911 0.9908 0.9906
dispcorr: -0.022223143 hartree
energy: -1079.775024488376
dipole: -27.63932 27.56974 -0.06958 -14.03396 14.07518 0.04122 6.92338 -6.07554 0.84784
magnitude: 0.85169 au
magnitude: 2.16482 debye
