program: Orca
programVersion: 5.0.2
elementType: O O O C C C C C C C C C C C C C C C C C C C C C C H H H H H H H H H H H H H H H H H H H H H H H H H H
charge: 0
multiplicity: 1
keywords: wb97x-d3
keywords: def2-TZVPP
keywords: def2/J RIJCOSX
keywords: DEFGRID2
keywords: scfconv7
keywords: smallprint printgap noloewdin
keywords: NOSOSCF
formula: C22H26O3
InChI: InChI=1/C22H26O3/c1-15(2)10-19-20(22(19,3)4)21(23)25-14-17-12-18(24-13-17)11-16-8-6-5-7-9-16/h5-10,12-13,19-20H,11,14H2,1-4H3
51 atoms
O  -1.404863 1.913003 0.902582
O  -0.714613 -0.067651 1.677684
O  1.782674 1.453869 -1.792069
C  -3.167763 -1.028218 -0.079568
C  -3.497028 -1.100409 1.380721
C  -2.935682 0.18118 0.815007
C  -2.005606 -1.8343 -0.603232
C  -4.297882 -0.89676 -1.070673
C  -4.893261 -1.119875 1.882363
C  -1.576498 0.618151 1.183248
C  -5.53392 -2.204186 2.327907
C  -6.936331 -2.118616 2.849227
C  -4.928704 -3.574358 2.355359
C  -0.130164 2.493052 1.163329
C  0.845999 2.187211 0.08108
C  2.218927 2.592346 0.05208
C  0.640178 1.502224 -1.066514
C  2.735992 2.119188 -1.106605
C  4.100843 2.155601 -1.690753
C  4.755905 0.794363 -1.66913
C  4.89528 0.045909 -2.832381
C  5.207012 0.256635 -0.465666
C  5.481616 -1.213854 -2.797378
C  5.792815 -0.999525 -0.427371
C  5.932408 -1.739571 -1.595411
H  -2.785082 -1.676701 1.96434
H  -3.64115 0.992168 0.665985
H  -1.237249 -2.018309 0.144517
H  -2.362812 -2.807071 -0.947603
H  -1.53372 -1.341965 -1.456707
H  -5.109623 -0.269742 -0.70297
H  -3.942816 -0.463572 -2.007821
H  -4.719215 -1.878388 -1.299022
H  -5.423361 -0.171493 1.887251
H  -7.32588 -1.100832 2.819941
H  -6.992849 -2.46952 3.883297
H  -7.611782 -2.755359 2.271523
H  -4.831187 -3.937508 3.38219
H  -3.946144 -3.623516 1.888847
H  -5.575127 -4.288292 1.838332
H  0.253801 2.175872 2.135856
H  -0.310685 3.567089 1.223691
H  2.74867 3.157008 0.803664
H  -0.220749 1.014984 -1.497558
H  4.69306 2.867285 -1.11298
H  4.06323 2.53472 -2.715544
H  4.547973 0.451164 -3.775669
H  5.099217 0.827341 0.44994
H  5.58578 -1.783708 -3.712117
H  6.142099 -1.402076 0.515118
H  6.389441 -2.720504 -1.566868
elementType: O C H
totalener: -1079.75357592 hartree
nucrepener: 2056.80952141 hartree
electener: -3136.56309734 hartree
oneelecener: -5552.99193845 hartree
twoeener: 2416.42884112 hartree
cpcmener: -0.02767530 hartree
kineticenergy: 1074.85717532 hartree
xcener: -106.461870388403 hartree
chargesum: 0.0000000
charge: -0.290635 -0.461173 -0.282759 0.151900 -0.010458 -0.115715 -0.295094 -0.265668 -0.265120 0.371793 -0.031077 -0.228110 -0.251729 0.101009 -0.026033 -0.350863 -0.057314 0.211407 -0.064255 0.039743 -0.187791 -0.188758 -0.155496 -0.159529 -0.168778 0.098598 0.090693 0.096674 0.098329 0.094040 0.090258 0.098130 0.095874 0.119557 0.088589 0.093850 0.093464 0.099327 0.088585 0.094215 0.114397 0.123380 0.159244 0.170050 0.115959 0.108406 0.138193 0.141702 0.155847 0.155735 0.157404
qa: -0.2906 -0.4612 -0.2828 0.1519 -0.0105 -0.1157 -0.2951 -0.2657 -0.2651 0.3718 -0.0311 -0.2281 -0.2517 0.1010 -0.0260 -0.3509 -0.0573 0.2114 -0.0643 0.0397 -0.1878 -0.1888 -0.1555 -0.1595 -0.1688 0.0986 0.0907 0.0967 0.0983 0.0940 0.0903 0.0981 0.0959 0.1196 0.0886 0.0939 0.0935 0.0993 0.0886 0.0942 0.1144 0.1234 0.1592 0.1701 0.1160 0.1084 0.1382 0.1417 0.1558 0.1557 0.1574
va: 2.1217 2.0361 2.2730 3.6642 3.7909 3.8771 3.8972 3.9035 3.8717 4.2045 3.7041 3.9279 3.9427 3.8332 3.6224 4.0098 3.9534 3.6209 3.8235 3.5989 3.9529 3.9383 3.8973 3.9103 3.8982 1.0264 1.0381 1.0169 1.0025 1.0031 1.0028 1.0029 1.0029 1.0077 1.0080 0.9949 0.9966 0.9978 1.0077 0.9981 1.0108 0.9910 1.0063 0.9964 1.0068 1.0085 1.0050 1.0035 0.9913 0.9917 0.9904
dispcorr: -0.022737154 hartree
energy: -1079.776313078835
dipole: -26.23206 25.63671 -0.59535 -16.07784 16.59123 0.51339 4.63690 -4.85450 -0.21760
magnitude: 0.81569 au
magnitude: 2.07332 debye
