program: Orca
programVersion: 5.0.2
elementType: O O O C C C C C C C C C C C C C C C C C C C C C C H H H H H H H H H H H H H H H H H H H H H H H H H H
charge: 0
multiplicity: 1
keywords: wb97x-d3
keywords: def2-TZVPP
keywords: def2/J RIJCOSX
keywords: DEFGRID2
keywords: scfconv7
keywords: smallprint printgap noloewdin
keywords: NOSOSCF
formula: C22H26O3
InChI: InChI=1/C22H26O3/c1-15(2)10-19-20(22(19,3)4)21(23)25-14-17-12-18(24-13-17)11-16-8-6-5-7-9-16/h5-10,12-13,19-20H,11,14H2,1-4H3
51 atoms
O  -1.616214 2.104106 0.748631
O  -0.710878 0.267388 1.64175
O  1.776204 1.853918 -1.71804
C  -2.860079 -1.059011 -0.266983
C  -3.246468 -1.201151 1.175975
C  -2.880371 0.164563 0.633622
C  -1.543712 -1.6437 -0.718449
C  -3.927696 -1.114862 -1.331677
C  -4.631807 -1.449873 1.62238
C  -1.627401 0.807752 1.071214
C  -4.994956 -2.370124 2.52081
C  -6.422889 -2.510081 2.952961
C  -4.020222 -3.303956 3.185499
C  -0.427019 2.836956 1.042829
C  0.67316 2.49363 0.09708
C  2.078516 2.563627 0.353265
C  0.553608 2.056452 -1.178306
C  2.699198 2.165607 -0.78346
C  4.127814 1.984753 -1.142477
C  4.481777 0.55189 -1.468256
C  5.162536 0.238877 -2.639607
C  4.150992 -0.478348 -0.590149
C  5.514829 -1.074158 -2.927362
C  4.498817 -1.789989 -0.875579
C  5.18408 -2.092627 -2.045984
H  -2.475299 -1.648164 1.794779
H  -3.698571 0.852634 0.449306
H  -0.806507 -1.706863 0.078793
H  -1.700112 -2.656048 -1.096367
H  -1.110243 -1.055038 -1.530354
H  -4.850354 -0.616289 -1.03694
H  -3.578015 -0.638355 -2.249756
H  -4.173708 -2.151504 -1.571534
H  -5.402958 -0.812537 1.199411
H  -7.074446 -1.780176 2.472021
H  -6.518028 -2.383658 4.035217
H  -6.807402 -3.508256 2.726289
H  -3.255314 -3.673309 2.502029
H  -4.532488 -4.173568 3.599074
H  -3.503377 -2.818642 4.018059
H  -0.113418 2.675981 2.076451
H  -0.714399 3.885052 0.951434
H  2.559055 2.860933 1.272619
H  -0.295225 1.846037 -1.810123
H  4.726912 2.33372 -0.298005
H  4.389225 2.625315 -1.989598
H  5.42106 1.028637 -3.335467
H  3.616111 -0.254005 0.326014
H  6.045504 -1.299493 -3.843899
H  4.235755 -2.578671 -0.181968
H  5.456417 -3.116571 -2.268214
elementType: O C H
totalener: -1079.75286750 hartree
nucrepener: 2081.91761385 hartree
electener: -3161.67048135 hartree
oneelecener: -5603.34262005 hartree
twoeener: 2441.67213870 hartree
cpcmener: -0.02680307 hartree
kineticenergy: 1074.85805861 hartree
xcener: -106.462154332770 hartree
chargesum: 0.0000000
charge: -0.288775 -0.462722 -0.280923 0.112342 0.045959 -0.095383 -0.280421 -0.269873 -0.304916 0.367042 -0.011263 -0.221498 -0.284498 0.111958 -0.022517 -0.348305 -0.067528 0.206239 -0.046379 0.009571 -0.176514 -0.186962 -0.154482 -0.158446 -0.168322 0.092894 0.089646 0.095087 0.098828 0.093345 0.088142 0.096826 0.097328 0.116899 0.085348 0.097337 0.093297 0.099734 0.094551 0.106585 0.114591 0.116906 0.160214 0.172038 0.111778 0.103321 0.138819 0.143940 0.156018 0.156982 0.156166
qa: -0.2888 -0.4627 -0.2809 0.1123 0.0460 -0.0954 -0.2804 -0.2699 -0.3049 0.3670 -0.0113 -0.2215 -0.2845 0.1120 -0.0225 -0.3483 -0.0675 0.2062 -0.0464 0.0096 -0.1765 -0.1870 -0.1545 -0.1584 -0.1683 0.0929 0.0896 0.0951 0.0988 0.0933 0.0881 0.0968 0.0973 0.1169 0.0853 0.0973 0.0933 0.0997 0.0946 0.1066 0.1146 0.1169 0.1602 0.1720 0.1118 0.1033 0.1388 0.1439 0.1560 0.1570 0.1562
va: 2.1220 2.0336 2.2722 3.6883 3.7739 3.8344 3.9020 3.9078 3.9019 4.2162 3.7043 3.9253 3.9428 3.8155 3.6061 4.0042 3.9487 3.6233 3.8281 3.6532 3.9367 3.9271 3.8966 3.9024 3.8996 1.0311 1.0360 1.0177 1.0019 1.0026 1.0054 1.0024 1.0018 1.0105 1.0100 0.9931 0.9945 0.9981 1.0026 0.9943 1.0114 0.9912 1.0061 0.9988 1.0042 1.0081 1.0035 1.0055 0.9913 0.9920 0.9911
dispcorr: -0.022658923 hartree
energy: -1079.775526420910
dipole: -22.48470 21.99473 -0.48997 -17.39290 17.80268 0.40978 5.81435 -5.95943 -0.14508
magnitude: 0.65501 au
magnitude: 1.66490 debye
