program: Orca
programVersion: 5.0.2
elementType: O O O C C C C C C C C C C C C C C C C C C C C C C H H H H H H H H H H H H H H H H H H H H H H H H H H
charge: 0
multiplicity: 1
keywords: wb97x-d3
keywords: def2-TZVPP
keywords: def2/J RIJCOSX
keywords: DEFGRID2
keywords: scfconv7
keywords: smallprint printgap noloewdin
keywords: NOSOSCF
formula: C22H26O3
InChI: InChI=1/C22H26O3/c1-15(2)10-19-20(22(19,3)4)21(23)25-14-17-12-18(24-13-17)11-16-8-6-5-7-9-16/h5-10,12-13,19-20H,11,14H2,1-4H3
51 atoms
O  -1.382905 1.794601 0.958416
O  -0.733631 -0.24787 1.603364
O  1.798352 1.476393 -1.75907
C  -3.198342 -1.073253 -0.193464
C  -3.58748 -1.157384 1.25281
C  -2.937204 0.106262 0.726984
C  -2.062145 -1.94333 -0.673091
C  -4.262349 -0.855701 -1.241695
C  -4.989193 -1.098491 1.713255
C  -1.577956 0.485602 1.149353
C  -5.558961 -1.974301 2.546091
C  -6.981565 -1.811214 2.986686
C  -4.82752 -3.16405 3.109972
C  -0.10317 2.341442 1.258055
C  0.871988 2.09594 0.159348
C  2.249536 2.48557 0.155282
C  0.65752 1.491176 -1.031271
C  2.760341 2.083451 -1.032967
C  4.123222 2.147962 -1.618428
C  4.767985 0.784576 -1.71298
C  5.041105 0.204338 -2.946155
C  5.088748 0.080581 -0.553948
C  5.63109 -1.052026 -3.023194
C  5.677052 -1.172697 -0.627141
C  5.951236 -1.743784 -1.864404
H  -2.928241 -1.783109 1.846594
H  -3.601863 0.949489 0.572998
H  -1.348213 -2.189213 0.109749
H  -2.46309 -2.885502 -1.052627
H  -1.515782 -1.468885 -1.491559
H  -5.038203 -0.161886 -0.919734
H  -3.820021 -0.450459 -2.154117
H  -4.747489 -1.799073 -1.500838
H  -5.586508 -0.267265 1.349953
H  -7.583659 -2.678925 2.703651
H  -7.447988 -0.923345 2.559215
H  -7.048225 -1.734446 4.07567
H  -5.512506 -3.841117 3.621051
H  -4.070575 -2.8682 3.840692
H  -4.317679 -3.742324 2.337858
H  0.275402 1.961109 2.209911
H  -0.272796 3.411635 1.384771
H  2.786176 2.993746 0.941577
H  -0.211115 1.045123 -1.490506
H  4.726066 2.80492 -0.988405
H  4.087556 2.609765 -2.608834
H  4.793534 0.738624 -3.856063
H  4.876067 0.518274 0.415095
H  5.83941 -1.489463 -3.991527
H  5.923867 -1.70521 0.282783
H  6.411965 -2.721678 -1.922479
elementType: O C H
totalener: -1079.75303127 hartree
nucrepener: 2052.40441808 hartree
electener: -3132.15744935 hartree
oneelecener: -5544.15978030 hartree
twoeener: 2412.00233096 hartree
cpcmener: -0.02770043 hartree
kineticenergy: 1074.85229873 hartree
xcener: -106.461241989937 hartree
chargesum: -0.0000000
charge: -0.289999 -0.461570 -0.282694 0.113346 0.045919 -0.103481 -0.278607 -0.266139 -0.301031 0.365676 -0.013372 -0.219878 -0.284861 0.100960 -0.022150 -0.352904 -0.057349 0.216401 -0.061020 0.025509 -0.183582 -0.185920 -0.155811 -0.161182 -0.168335 0.093876 0.087996 0.094410 0.098161 0.092913 0.086845 0.097068 0.097226 0.116513 0.094582 0.084116 0.097938 0.094783 0.104496 0.103026 0.114001 0.122681 0.159344 0.167506 0.116082 0.105640 0.139284 0.142952 0.156456 0.156817 0.157360
qa: -0.2900 -0.4616 -0.2827 0.1133 0.0459 -0.1035 -0.2786 -0.2661 -0.3010 0.3657 -0.0134 -0.2199 -0.2849 0.1010 -0.0222 -0.3529 -0.0573 0.2164 -0.0610 0.0255 -0.1836 -0.1859 -0.1558 -0.1612 -0.1683 0.0939 0.0880 0.0944 0.0982 0.0929 0.0868 0.0971 0.0972 0.1165 0.0946 0.0841 0.0979 0.0948 0.1045 0.1030 0.1140 0.1227 0.1593 0.1675 0.1161 0.1056 0.1393 0.1430 0.1565 0.1568 0.1574
va: 2.1187 2.0354 2.2724 3.6892 3.7754 3.8539 3.9015 3.9083 3.8929 4.1986 3.6972 3.9216 3.9409 3.8339 3.6182 4.0059 3.9558 3.6103 3.8246 3.6244 3.9462 3.9343 3.8966 3.9118 3.8994 1.0271 1.0388 1.0188 1.0015 1.0027 1.0057 1.0020 1.0021 1.0100 0.9938 1.0104 0.9926 1.0041 0.9957 0.9961 1.0104 0.9908 1.0063 0.9981 1.0056 1.0094 1.0040 1.0038 0.9912 0.9916 0.9905
dispcorr: -0.022297570 hartree
energy: -1079.775328837228
dipole: -26.06083 25.52715 -0.53368 -14.63907 15.25404 0.61497 5.78179 -5.87522 -0.09342
magnitude: 0.81959 au
magnitude: 2.08324 debye
