program: Orca
programVersion: 5.0.2
elementType: O O O C C C C C C C C C C C C C C C C C C C C C C H H H H H H H H H H H H H H H H H H H H H H H H H H
charge: 0
multiplicity: 1
keywords: wb97x-d3
keywords: def2-TZVPP
keywords: def2/J RIJCOSX
keywords: DEFGRID2
keywords: scfconv7
keywords: smallprint printgap noloewdin
keywords: NOSOSCF
formula: C22H26O3
InChI: InChI=1/C22H26O3/c1-15(2)10-19-20(22(19,3)4)21(23)25-14-17-12-18(24-13-17)11-16-8-6-5-7-9-16/h5-10,12-13,19-20H,11,14H2,1-4H3
51 atoms
O  -2.101651 2.028097 -0.015621
O  -1.455878 1.749946 2.103641
O  1.879681 1.766932 -1.5259
C  -3.949158 -0.396835 0.399234
C  -2.669662 -0.787763 -0.25387
C  -2.63923 -0.00172 1.058533
C  -4.833999 0.632662 -0.261564
C  -4.739011 -1.442968 1.150306
C  -2.130597 -2.165108 -0.305328
C  -2.026547 1.337549 1.11854
C  -0.883421 -2.433476 -0.704535
C  -0.366434 -3.834754 -0.794715
C  0.072989 -1.340752 -1.099112
C  -1.224923 3.155237 -0.190488
C  0.158989 2.679622 -0.462078
C  1.216357 2.441366 0.474549
C  0.628148 2.24838 -1.657453
C  2.2345 1.886921 -0.22368
C  3.555766 1.341984 0.181251
C  3.542021 -0.168871 0.20809
C  2.938821 -0.842407 1.267894
C  4.08404 -0.909563 -0.836393
C  2.884676 -2.227859 1.287175
C  4.031717 -2.298384 -0.820355
C  3.43268 -2.960925 0.241216
H  -2.40757 -0.178124 -1.113892
H  -2.397848 -0.58028 1.943304
H  -4.292747 1.316375 -0.910991
H  -5.583269 0.129169 -0.87596
H  -5.368436 1.225722 0.483481
H  -5.373963 -2.009636 0.466012
H  -4.104827 -2.153407 1.680343
H  -5.389843 -0.97204 1.889633
H  -2.78431 -2.984997 -0.02369
H  -1.119741 -4.572817 -0.51854
H  0.500938 -3.97478 -0.143919
H  -0.026642 -4.062172 -1.809075
H  -0.202265 -0.894444 -2.058726
H  1.09046 -1.717587 -1.203882
H  0.091232 -0.531928 -0.36565
H  -1.267263 3.822977 0.670236
H  -1.6332 3.686681 -1.048386
H  1.213503 2.654282 1.531679
H  0.197281 2.227052 -2.647004
H  3.789251 1.732596 1.172973
H  4.338188 1.698819 -0.493303
H  2.504664 -0.275994 2.084166
H  4.554709 -0.399055 -1.668537
H  2.414454 -2.736991 2.119101
H  4.460325 -2.862066 -1.639475
H  3.394288 -4.042723 0.256403
elementType: O C H
totalener: -1079.74847259 hartree
nucrepener: 2244.33522296 hartree
electener: -3324.08369555 hartree
oneelecener: -5928.00781741 hartree
twoeener: 2603.92412186 hartree
cpcmener: -0.02484101 hartree
kineticenergy: 1074.86239815 hartree
xcener: -106.463180255572 hartree
chargesum: 0.0000000
charge: -0.278708 -0.472078 -0.270445 0.151695 -0.010314 -0.069583 -0.268449 -0.297571 -0.323212 0.373925 0.048229 -0.222250 -0.310317 0.059463 -0.071897 -0.276598 -0.048560 0.174139 -0.055964 0.063320 -0.220722 -0.192646 -0.131213 -0.123297 -0.211102 0.096507 0.087804 0.092660 0.092516 0.099522 0.101571 0.087425 0.099418 0.123379 0.090187 0.089923 0.101741 0.119405 0.083122 0.083021 0.119390 0.114507 0.157353 0.172655 0.115582 0.109577 0.139180 0.137475 0.156342 0.154968 0.158927
qa: -0.2787 -0.4721 -0.2704 0.1517 -0.0103 -0.0696 -0.2684 -0.2976 -0.3232 0.3739 0.0482 -0.2222 -0.3103 0.0595 -0.0719 -0.2766 -0.0486 0.1741 -0.0560 0.0633 -0.2207 -0.1926 -0.1312 -0.1233 -0.2111 0.0965 0.0878 0.0927 0.0925 0.0995 0.1016 0.0874 0.0994 0.1234 0.0902 0.0899 0.1017 0.1194 0.0831 0.0830 0.1194 0.1145 0.1574 0.1727 0.1156 0.1096 0.1392 0.1375 0.1563 0.1550 0.1589
va: 2.1000 2.0331 2.2637 3.7576 3.7630 3.8143 3.8720 3.9191 3.8809 4.1862 3.6569 3.9116 3.9835 3.8616 3.6347 3.9848 3.9190 3.6561 3.8111 3.5481 3.9031 3.9521 3.8183 3.8530 3.8738 1.0255 1.0302 1.0152 1.0009 1.0003 0.9988 1.0026 1.0016 1.0072 1.0106 0.9971 0.9940 1.0002 1.0171 0.9916 1.0059 0.9999 1.0172 0.9953 1.0084 1.0102 1.0062 1.0062 0.9905 0.9910 0.9904
dispcorr: -0.029476309 hartree
energy: -1079.777948896834
dipole: -12.56241 12.43632 -0.12610 -15.28442 14.99921 -0.28521 -2.37221 1.33327 -1.03894
magnitude: 1.08473 au
magnitude: 2.75716 debye
