program: Orca
programVersion: 5.0.2
elementType: O O O C C C C C C C C C C C C C C C C C C C C C C H H H H H H H H H H H H H H H H H H H H H H H H H H
charge: 0
multiplicity: 1
keywords: wb97x-d3
keywords: def2-TZVPP
keywords: def2/J RIJCOSX
keywords: DEFGRID2
keywords: scfconv7
keywords: smallprint printgap noloewdin
keywords: NOSOSCF
formula: C22H26O3
InChI: InChI=1/C22H26O3/c1-15(2)10-19-20(22(19,3)4)21(23)25-14-17-12-18(24-13-17)11-16-8-6-5-7-9-16/h5-10,12-13,19-20H,11,14H2,1-4H3
51 atoms
O  -1.409487 2.108124 0.877211
O  -2.118998 1.292193 -1.078939
O  2.174425 2.065845 -1.700164
C  -4.097786 -0.251676 0.839479
C  -3.030326 -1.168698 0.322992
C  -2.633771 0.143645 0.956874
C  -5.004965 0.437902 -0.148521
C  -4.788052 -0.597299 2.135829
C  -2.67596 -2.438007 1.003542
C  -2.046926 1.212703 0.1255
C  -3.004357 -3.660448 0.576344
C  -2.582448 -4.884924 1.33072
C  -3.807315 -3.924684 -0.660368
C  -0.74156 3.191556 0.208035
C  0.58186 2.775002 -0.328468
C  1.817718 2.68672 0.391775
C  0.868727 2.381691 -1.592071
C  2.750082 2.254793 -0.489149
C  4.194607 1.933503 -0.360819
C  4.455609 0.446397 -0.416345
C  4.127062 -0.360364 0.670875
C  5.005348 -0.14506 -1.548157
C  4.349222 -1.728323 0.630105
C  5.228774 -1.516223 -1.592603
C  4.902007 -2.311265 -0.503805
H  -2.947436 -1.180683 -0.759764
H  -2.232507 0.090019 1.963668
H  -4.541575 0.598841 -1.119366
H  -5.896776 -0.170796 -0.311736
H  -5.336446 1.406769 0.231643
H  -4.114621 -1.046024 2.865643
H  -5.221791 0.294875 2.591983
H  -5.600607 -1.305429 1.958705
H  -2.103032 -2.353242 1.922871
H  -1.996955 -4.642163 2.217625
H  -1.980885 -5.546742 0.701677
H  -3.450121 -5.468931 1.649612
H  -4.114047 -3.018846 -1.180699
H  -4.712915 -4.486237 -0.415591
H  -3.245347 -4.542516 -1.365951
H  -0.620132 3.953078 0.976894
H  -1.376673 3.606155 -0.575464
H  1.983932 2.923561 1.431455
H  0.271746 2.292809 -2.486184
H  4.542382 2.338488 0.591166
H  4.763279 2.440179 -1.145067
H  3.695655 0.087645 1.55898
H  5.266764 0.469748 -2.401583
H  4.093822 -2.340739 1.485705
H  5.660173 -1.961793 -2.480163
H  5.07806 -3.378925 -0.536149
elementType: O C H
totalener: -1079.75460547 hartree
nucrepener: 2075.56811306 hartree
electener: -3155.32271854 hartree
oneelecener: -5590.71042294 hartree
twoeener: 2435.38770440 hartree
cpcmener: -0.02537030 hartree
kineticenergy: 1074.86007956 hartree
xcener: -106.459572073046 hartree
chargesum: -0.0000000
charge: -0.285861 -0.478450 -0.276995 0.146051 -0.002590 -0.129183 -0.293214 -0.263524 -0.265441 0.412659 -0.032265 -0.228221 -0.251064 0.089737 -0.085151 -0.332868 -0.011531 0.203987 -0.065207 0.044512 -0.191856 -0.190583 -0.159395 -0.154406 -0.170085 0.095108 0.087925 0.093219 0.094010 0.099247 0.089468 0.097472 0.095340 0.119701 0.088499 0.093983 0.093408 0.087932 0.095151 0.097332 0.120365 0.118538 0.160125 0.168816 0.116785 0.108345 0.141007 0.139344 0.156736 0.155553 0.157535
qa: -0.2859 -0.4785 -0.2770 0.1461 -0.0026 -0.1292 -0.2932 -0.2635 -0.2654 0.4127 -0.0323 -0.2282 -0.2511 0.0897 -0.0852 -0.3329 -0.0115 0.2040 -0.0652 0.0445 -0.1919 -0.1906 -0.1594 -0.1544 -0.1701 0.0951 0.0879 0.0932 0.0940 0.0992 0.0895 0.0975 0.0953 0.1197 0.0885 0.0940 0.0934 0.0879 0.0952 0.0973 0.1204 0.1185 0.1601 0.1688 0.1168 0.1083 0.1410 0.1393 0.1567 0.1556 0.1575
va: 2.1254 2.0265 2.2830 3.6707 3.7726 3.9000 3.9009 3.9062 3.8740 4.1766 3.7091 3.9271 3.9439 3.8092 3.6234 4.0163 3.9512 3.6234 3.8224 3.5944 3.9413 3.9534 3.9087 3.8964 3.8993 1.0287 1.0382 1.0194 1.0011 0.9993 1.0030 1.0030 1.0031 1.0080 1.0081 0.9954 0.9962 1.0083 0.9974 0.9981 0.9947 1.0116 1.0073 1.0056 1.0062 1.0092 1.0038 1.0048 0.9913 0.9914 0.9905
dispcorr: -0.022079403 hartree
energy: -1079.776684877779
dipole: -22.69714 22.66875 -0.02840 -19.56594 19.51156 -0.05438 7.20104 -6.12360 1.07744
magnitude: 1.07919 au
magnitude: 2.74308 debye
