program: Orca
programVersion: 5.0.2
elementType: O O O C C C C C C C C C C C C C C C C C C C C C C H H H H H H H H H H H H H H H H H H H H H H H H H H
charge: 0
multiplicity: 1
keywords: wb97x-d3
keywords: def2-TZVPP
keywords: def2/J RIJCOSX
keywords: DEFGRID2
keywords: scfconv7
keywords: smallprint printgap noloewdin
keywords: NOSOSCF
formula: C22H26O3
InChI: InChI=1/C22H26O3/c1-15(2)10-19-20(22(19,3)4)21(23)25-14-17-12-18(24-13-17)11-16-8-6-5-7-9-16/h5-10,12-13,19-20H,11,14H2,1-4H3
51 atoms
O  -1.709619 1.587833 -0.327991
O  -1.927753 -0.460906 -1.197642
O  1.927759 0.198656 1.196499
C  -4.804026 -0.293227 0.076635
C  -3.902875 -1.042742 0.995759
C  -3.46924 0.320047 0.465027
C  -5.029328 -0.835612 -1.313561
C  -6.012808 0.419848 0.63437
C  -4.178599 -1.222297 2.440728
C  -2.316126 0.401295 -0.446324
C  -3.307094 -1.702325 3.333049
C  -3.688217 -1.879081 4.771578
C  -1.903579 -2.101099 2.993824
C  -0.496669 1.797074 -1.043124
C  0.659825 1.181744 -0.334176
C  2.001347 1.090248 -0.826018
C  0.678248 0.626943 0.899084
C  2.726065 0.48566 0.146424
C  4.165316 0.124733 0.272127
C  4.879055 0.205469 -1.049515
C  4.67158 -0.774071 -2.018881
C  5.740526 1.258563 -1.335837
C  5.313074 -0.702646 -3.245996
C  6.386579 1.332812 -2.564238
C  6.17391 0.352823 -3.522658
H  -3.376114 -1.866319 0.521867
H  -3.537259 1.142277 1.168095
H  -4.196534 -1.430409 -1.681606
H  -5.912438 -1.478013 -1.313353
H  -5.210819 -0.029824 -2.027731
H  -6.853148 -0.26852 0.74669
H  -5.824899 0.878049 1.605278
H  -6.328637 1.215327 -0.043376
H  -5.171114 -0.954356 2.790998
H  -3.044121 -1.283971 5.424677
H  -3.568529 -2.919364 5.086172
H  -4.721237 -1.587807 4.962372
H  -1.191587 -1.585523 3.643894
H  -1.625887 -1.886791 1.962618
H  -1.752134 -3.170573 3.164581
H  -0.380145 2.880505 -1.097104
H  -0.570492 1.429681 -2.06911
H  2.365332 1.431258 -1.782543
H  -0.078016 0.464688 1.651678
H  4.248979 -0.886777 0.681015
H  4.648938 0.786985 0.997004
H  4.000801 -1.599788 -1.810319
H  5.912585 2.027642 -0.591719
H  5.142381 -1.472727 -3.987714
H  7.058023 2.156878 -2.76999
H  6.676569 0.408307 -4.479855
elementType: O C H
totalener: -1079.75258462 hartree
nucrepener: 2067.50895197 hartree
electener: -3147.26153659 hartree
oneelecener: -5574.08308400 hartree
twoeener: 2426.82154741 hartree
cpcmener: -0.02504237 hartree
kineticenergy: 1074.84896439 hartree
xcener: -106.461882545680 hartree
chargesum: 0.0000000
charge: -0.293544 -0.467663 -0.285725 0.155173 -0.038650 -0.065064 -0.274497 -0.294350 -0.267061 0.352697 -0.008320 -0.230947 -0.267767 0.109972 -0.047273 -0.320120 -0.063392 0.187823 -0.012840 -0.002419 -0.201882 -0.174677 -0.147603 -0.156006 -0.166970 0.099890 0.090434 0.093064 0.094224 0.098096 0.102121 0.088506 0.098745 0.122800 0.094346 0.094155 0.088348 0.096722 0.079196 0.105523 0.121448 0.112868 0.160454 0.177208 0.110073 0.100642 0.142990 0.138899 0.156654 0.156152 0.157546
qa: -0.2935 -0.4677 -0.2857 0.1552 -0.0387 -0.0651 -0.2745 -0.2943 -0.2671 0.3527 -0.0083 -0.2309 -0.2678 0.1100 -0.0473 -0.3201 -0.0634 0.1878 -0.0128 -0.0024 -0.2019 -0.1747 -0.1476 -0.1560 -0.1670 0.0999 0.0904 0.0931 0.0942 0.0981 0.1021 0.0885 0.0987 0.1228 0.0943 0.0942 0.0883 0.0967 0.0792 0.1055 0.1214 0.1129 0.1605 0.1772 0.1101 0.1006 0.1430 0.1389 0.1567 0.1562 0.1575
va: 2.1142 2.0276 2.2687 3.7404 3.8285 3.7941 3.8823 3.9176 3.8894 4.1800 3.6940 3.9303 3.9501 3.8240 3.6834 3.9893 3.9506 3.6673 3.8095 3.6321 3.9327 3.9227 3.8888 3.8991 3.8957 1.0221 1.0343 1.0197 1.0006 0.9997 0.9986 1.0016 1.0024 1.0038 0.9963 0.9955 1.0072 0.9962 1.0120 0.9999 0.9908 1.0131 1.0012 0.9908 1.0066 1.0067 1.0020 1.0044 0.9908 0.9912 0.9903
dispcorr: -0.022968519 hartree
energy: -1079.775553134430
dipole: -21.92281 21.83877 -0.08404 -7.25903 7.90896 0.64993 10.26306 -9.72442 0.53864
magnitude: 0.84830 au
magnitude: 2.15620 debye
